%YAML 1.1
%TAG !u! tag:unity3d.com,2011:
--- !u!74 &7400000
AnimationClip:
  m_ObjectHideFlags: 0
  m_CorrespondingSourceObject: {fileID: 0}
  m_PrefabInstance: {fileID: 0}
  m_PrefabAsset: {fileID: 0}
  m_Name: Run
  serializedVersion: 6
  m_Legacy: 0
  m_Compressed: 0
  m_UseHighQualityCurve: 1
  m_RotationCurves: []
  m_CompressedRotationCurves: []
  m_EulerCurves: []
  m_PositionCurves: []
  m_ScaleCurves: []
  m_FloatCurves: []
  m_PPtrCurves:
  - curve:
    - time: 0
      value: {fileID: 4944230376442633554, guid: 8adf9ec1235294a40ad2adc583aadbd3,
        type: 3}
    - time: 0.016666668
      value: {fileID: -2274363484027164459, guid: 8adf9ec1235294a40ad2adc583aadbd3,
        type: 3}
    - time: 0.033333335
      value: {fileID: 8284087734974297348, guid: 8adf9ec1235294a40ad2adc583aadbd3,
        type: 3}
    - time: 0.050000004
      value: {fileID: 5304202850863732263, guid: 8adf9ec1235294a40ad2adc583aadbd3,
        type: 3}
    - time: 0.06666667
      value: {fileID: 2833043080597125133, guid: 8adf9ec1235294a40ad2adc583aadbd3,
        type: 3}
    - time: 0.083333336
      value: {fileID: -2217414122262695004, guid: 8adf9ec1235294a40ad2adc583aadbd3,
        type: 3}
    - time: 0.10000001
      value: {fileID: -4440497016933152808, guid: 8adf9ec1235294a40ad2adc583aadbd3,
        type: 3}
    - time: 0.116666675
      value: {fileID: 8676454946275842879, guid: 8adf9ec1235294a40ad2adc583aadbd3,
        type: 3}
    - time: 0.13333334
      value: {fileID: -6351944509545543589, guid: 8adf9ec1235294a40ad2adc583aadbd3,
        type: 3}
    - time: 0.15
      value: {fileID: 2158891789428380870, guid: 8adf9ec1235294a40ad2adc583aadbd3,
        type: 3}
    - time: 0.16666667
      value: {fileID: 9151066736925549315, guid: 8adf9ec1235294a40ad2adc583aadbd3,
        type: 3}
    - time: 0.18333334
      value: {fileID: -7266845314124737194, guid: 8adf9ec1235294a40ad2adc583aadbd3,
        type: 3}
    - time: 0.20000002
      value: {fileID: -5168576596277122810, guid: 8adf9ec1235294a40ad2adc583aadbd3,
        type: 3}
    - time: 0.21666668
      value: {fileID: -7303085922518154401, guid: 8adf9ec1235294a40ad2adc583aadbd3,
        type: 3}
    - time: 0.23333335
      value: {fileID: -3387832490922303652, guid: 8adf9ec1235294a40ad2adc583aadbd3,
        type: 3}
    - time: 0.25
      value: {fileID: 2196459547150753776, guid: 8adf9ec1235294a40ad2adc583aadbd3,
        type: 3}
    - time: 0.26666668
      value: {fileID: -2969576599511150121, guid: 8adf9ec1235294a40ad2adc583aadbd3,
        type: 3}
    - time: 0.28333336
      value: {fileID: -1100304572229716114, guid: 8adf9ec1235294a40ad2adc583aadbd3,
        type: 3}
    - time: 0.3
      value: {fileID: -1286830556838052669, guid: 8adf9ec1235294a40ad2adc583aadbd3,
        type: 3}
    - time: 0.3166667
      value: {fileID: -4740722875278701659, guid: 8adf9ec1235294a40ad2adc583aadbd3,
        type: 3}
    - time: 0.33333334
      value: {fileID: -6219685122133649782, guid: 8adf9ec1235294a40ad2adc583aadbd3,
        type: 3}
    - time: 0.35000002
      value: {fileID: -5210376377794636309, guid: 8adf9ec1235294a40ad2adc583aadbd3,
        type: 3}
    - time: 0.36666667
      value: {fileID: -227415817694919712, guid: 8adf9ec1235294a40ad2adc583aadbd3,
        type: 3}
    - time: 0.38333336
      value: {fileID: 2448761691846615139, guid: 8adf9ec1235294a40ad2adc583aadbd3,
        type: 3}
    - time: 0.40000004
      value: {fileID: -8619701624676006709, guid: 8adf9ec1235294a40ad2adc583aadbd3,
        type: 3}
    - time: 0.4166667
      value: {fileID: -2187387491920451328, guid: 8adf9ec1235294a40ad2adc583aadbd3,
        type: 3}
    - time: 0.43333337
      value: {fileID: -314372617269588817, guid: 8adf9ec1235294a40ad2adc583aadbd3,
        type: 3}
    - time: 0.45000002
      value: {fileID: -1421584596269389621, guid: 8adf9ec1235294a40ad2adc583aadbd3,
        type: 3}
    - time: 0.4666667
      value: {fileID: -3001407226067449113, guid: 8adf9ec1235294a40ad2adc583aadbd3,
        type: 3}
    - time: 0.48333335
      value: {fileID: 2131885599912629922, guid: 8adf9ec1235294a40ad2adc583aadbd3,
        type: 3}
    - time: 0.5
      value: {fileID: -3457748248120550607, guid: 8adf9ec1235294a40ad2adc583aadbd3,
        type: 3}
    attribute: m_Sprite
    path: 
    classID: 212
    script: {fileID: 0}
  m_SampleRate: 60
  m_WrapMode: 0
  m_Bounds:
    m_Center: {x: 0, y: 0, z: 0}
    m_Extent: {x: 0, y: 0, z: 0}
  m_ClipBindingConstant:
    genericBindings:
    - serializedVersion: 2
      path: 0
      attribute: 0
      script: {fileID: 0}
      typeID: 212
      customType: 23
      isPPtrCurve: 1
    pptrCurveMapping:
    - {fileID: 4944230376442633554, guid: 8adf9ec1235294a40ad2adc583aadbd3, type: 3}
    - {fileID: -2274363484027164459, guid: 8adf9ec1235294a40ad2adc583aadbd3, type: 3}
    - {fileID: 8284087734974297348, guid: 8adf9ec1235294a40ad2adc583aadbd3, type: 3}
    - {fileID: 5304202850863732263, guid: 8adf9ec1235294a40ad2adc583aadbd3, type: 3}
    - {fileID: 2833043080597125133, guid: 8adf9ec1235294a40ad2adc583aadbd3, type: 3}
    - {fileID: -2217414122262695004, guid: 8adf9ec1235294a40ad2adc583aadbd3, type: 3}
    - {fileID: -4440497016933152808, guid: 8adf9ec1235294a40ad2adc583aadbd3, type: 3}
    - {fileID: 8676454946275842879, guid: 8adf9ec1235294a40ad2adc583aadbd3, type: 3}
    - {fileID: -6351944509545543589, guid: 8adf9ec1235294a40ad2adc583aadbd3, type: 3}
    - {fileID: 2158891789428380870, guid: 8adf9ec1235294a40ad2adc583aadbd3, type: 3}
    - {fileID: 9151066736925549315, guid: 8adf9ec1235294a40ad2adc583aadbd3, type: 3}
    - {fileID: -7266845314124737194, guid: 8adf9ec1235294a40ad2adc583aadbd3, type: 3}
    - {fileID: -5168576596277122810, guid: 8adf9ec1235294a40ad2adc583aadbd3, type: 3}
    - {fileID: -7303085922518154401, guid: 8adf9ec1235294a40ad2adc583aadbd3, type: 3}
    - {fileID: -3387832490922303652, guid: 8adf9ec1235294a40ad2adc583aadbd3, type: 3}
    - {fileID: 2196459547150753776, guid: 8adf9ec1235294a40ad2adc583aadbd3, type: 3}
    - {fileID: -2969576599511150121, guid: 8adf9ec1235294a40ad2adc583aadbd3, type: 3}
    - {fileID: -1100304572229716114, guid: 8adf9ec1235294a40ad2adc583aadbd3, type: 3}
    - {fileID: -1286830556838052669, guid: 8adf9ec1235294a40ad2adc583aadbd3, type: 3}
    - {fileID: -4740722875278701659, guid: 8adf9ec1235294a40ad2adc583aadbd3, type: 3}
    - {fileID: -6219685122133649782, guid: 8adf9ec1235294a40ad2adc583aadbd3, type: 3}
    - {fileID: -5210376377794636309, guid: 8adf9ec1235294a40ad2adc583aadbd3, type: 3}
    - {fileID: -227415817694919712, guid: 8adf9ec1235294a40ad2adc583aadbd3, type: 3}
    - {fileID: 2448761691846615139, guid: 8adf9ec1235294a40ad2adc583aadbd3, type: 3}
    - {fileID: -8619701624676006709, guid: 8adf9ec1235294a40ad2adc583aadbd3, type: 3}
    - {fileID: -2187387491920451328, guid: 8adf9ec1235294a40ad2adc583aadbd3, type: 3}
    - {fileID: -314372617269588817, guid: 8adf9ec1235294a40ad2adc583aadbd3, type: 3}
    - {fileID: -1421584596269389621, guid: 8adf9ec1235294a40ad2adc583aadbd3, type: 3}
    - {fileID: -3001407226067449113, guid: 8adf9ec1235294a40ad2adc583aadbd3, type: 3}
    - {fileID: 2131885599912629922, guid: 8adf9ec1235294a40ad2adc583aadbd3, type: 3}
    - {fileID: -3457748248120550607, guid: 8adf9ec1235294a40ad2adc583aadbd3, type: 3}
  m_AnimationClipSettings:
    serializedVersion: 2
    m_AdditiveReferencePoseClip: {fileID: 0}
    m_AdditiveReferencePoseTime: 0
    m_StartTime: 0
    m_StopTime: 0.51666665
    m_OrientationOffsetY: 0
    m_Level: 0
    m_CycleOffset: 0
    m_HasAdditiveReferencePose: 0
    m_LoopTime: 1
    m_LoopBlend: 0
    m_LoopBlendOrientation: 0
    m_LoopBlendPositionY: 0
    m_LoopBlendPositionXZ: 0
    m_KeepOriginalOrientation: 0
    m_KeepOriginalPositionY: 1
    m_KeepOriginalPositionXZ: 0
    m_HeightFromFeet: 0
    m_Mirror: 0
  m_EditorCurves: []
  m_EulerEditorCurves: []
  m_HasGenericRootTransform: 0
  m_HasMotionFloatCurves: 0
  m_Events: []
