%YAML 1.1
%TAG !u! tag:unity3d.com,2011:
--- !u!74 &7400000
AnimationClip:
  m_ObjectHideFlags: 0
  m_CorrespondingSourceObject: {fileID: 0}
  m_PrefabInstance: {fileID: 0}
  m_PrefabAsset: {fileID: 0}
  m_Name: Ready
  serializedVersion: 6
  m_Legacy: 0
  m_Compressed: 0
  m_UseHighQualityCurve: 1
  m_RotationCurves: []
  m_CompressedRotationCurves: []
  m_EulerCurves: []
  m_PositionCurves: []
  m_ScaleCurves: []
  m_FloatCurves: []
  m_PPtrCurves:
  - curve:
    - time: 0
      value: {fileID: 21300000, guid: 0dd9b0606a7876d40910c81dff07f09c, type: 3}
    - time: 0.016666668
      value: {fileID: 21300000, guid: 471fe2b826109de4cb1c82c1b56ba2d2, type: 3}
    - time: 0.033333335
      value: {fileID: 21300000, guid: 980b94b92085054479a334077a030d12, type: 3}
    - time: 0.05
      value: {fileID: 21300000, guid: 6a1fd1b47dd65ef45b4667a05ff197fb, type: 3}
    - time: 0.06666667
      value: {fileID: 21300000, guid: 143ef608be9f4cd42867a069456ead9d, type: 3}
    - time: 0.083333336
      value: {fileID: 21300000, guid: 9cb5becf82b10d94998c55ed09b55cb0, type: 3}
    - time: 0.1
      value: {fileID: 21300000, guid: 920439e4679ef7246a7902d11d8b3b0b, type: 3}
    - time: 0.11666667
      value: {fileID: 21300000, guid: 82c58c698e6159743baa46bd7ffe2308, type: 3}
    - time: 0.13333334
      value: {fileID: 21300000, guid: c3536d0a8bc3a854c892245df6101529, type: 3}
    - time: 0.15
      value: {fileID: 21300000, guid: 33f1b3d51d1ad4b43b1a7d87fa3325f1, type: 3}
    - time: 0.16666667
      value: {fileID: 21300000, guid: ff18747d8b2bc52479bff59b3528a6a5, type: 3}
    - time: 0.18333334
      value: {fileID: 21300000, guid: 56264c2265405fc4b8654af71a979e76, type: 3}
    - time: 0.2
      value: {fileID: 21300000, guid: e738a45bcc313544db4a20bc92aa5c0c, type: 3}
    - time: 0.21666667
      value: {fileID: 21300000, guid: 61f622a27a34538488a60c468b1a78ad, type: 3}
    - time: 0.23333333
      value: {fileID: 21300000, guid: 155a81fb98cf70c4cb285b5d22a4cfd4, type: 3}
    - time: 0.25
      value: {fileID: 21300000, guid: fdb0589e1e607064ebdabdbe1851261e, type: 3}
    - time: 0.26666668
      value: {fileID: 21300000, guid: a0fad08b3282d3445b138790f3176646, type: 3}
    - time: 0.28333333
      value: {fileID: 21300000, guid: fb554c6b96d033841a542197fcd5d263, type: 3}
    - time: 0.3
      value: {fileID: 21300000, guid: 7f5e1c58d6eab8448b81449b8bddc65d, type: 3}
    - time: 0.31666666
      value: {fileID: 21300000, guid: 7615965883759f14bbac379c8537f75b, type: 3}
    - time: 0.33333334
      value: {fileID: 21300000, guid: efe50e6d472424d44b524fa68fd35c5a, type: 3}
    - time: 0.35
      value: {fileID: 21300000, guid: ce1507f9cf3569b48a1f3a52fcefecf2, type: 3}
    - time: 0.36666667
      value: {fileID: 21300000, guid: 74e914c38a67a5441bcc5a48f96a441c, type: 3}
    - time: 0.38333333
      value: {fileID: 21300000, guid: d685c934438188b48bf638df77e7c284, type: 3}
    - time: 0.4
      value: {fileID: 21300000, guid: 72c05996b0e4d5f47a8a3c0e8d471c65, type: 3}
    - time: 0.41666666
      value: {fileID: 21300000, guid: 733af49444f3ead45ade24286ad7859e, type: 3}
    - time: 0.43333334
      value: {fileID: 21300000, guid: c993a46f732a953419e3501dd19495b0, type: 3}
    - time: 0.45
      value: {fileID: 21300000, guid: 68e8becfb1a8abb4d84c6aea0349d5a7, type: 3}
    - time: 0.46666667
      value: {fileID: 21300000, guid: 64d3e2d9f196a2f41b333d26fb6c4eff, type: 3}
    - time: 0.48333332
      value: {fileID: 21300000, guid: 83b69c4f75fcb7f40abfd872074078d8, type: 3}
    - time: 0.5
      value: {fileID: 21300000, guid: 47b3d56764373e84a9683c88c7a960f6, type: 3}
    - time: 0.51666665
      value: {fileID: 21300000, guid: a653ac31040bc4e418326a6f5bcb8d60, type: 3}
    - time: 0.53333336
      value: {fileID: 21300000, guid: f30d206dc5ed5244d9af65cc9fc2c735, type: 3}
    - time: 0.55
      value: {fileID: 21300000, guid: dbcf30c5800026d4d867ea0d983d1b6d, type: 3}
    - time: 0.56666666
      value: {fileID: 21300000, guid: 32394fac1e60e124eac4cead682b75ee, type: 3}
    - time: 0.5833333
      value: {fileID: 21300000, guid: 6fcddb94e2a4352429eccafb44d37101, type: 3}
    - time: 0.6
      value: {fileID: 21300000, guid: ecb730d5da88ed84aa8cbb6ad491c8b0, type: 3}
    - time: 0.6166667
      value: {fileID: 21300000, guid: 701fbb152904ccd4bbe690ad6108fc88, type: 3}
    - time: 0.6333333
      value: {fileID: 21300000, guid: d01d933614440ee448784d0213f856c7, type: 3}
    - time: 0.65
      value: {fileID: 21300000, guid: 039b1499d686cb14ca77f40b7aa7cb31, type: 3}
    - time: 0.6666667
      value: {fileID: 21300000, guid: 06fa35b49016f9e4ea0d18685f584bcf, type: 3}
    - time: 0.68333334
      value: {fileID: 21300000, guid: 99f63d1753b6e0143aedda4d6ef3b1ab, type: 3}
    - time: 0.7
      value: {fileID: 21300000, guid: 907c40f729cc58149afd4dd60d936858, type: 3}
    - time: 0.71666664
      value: {fileID: 21300000, guid: 25eede48a805a6e4db6ecf2d3f650848, type: 3}
    - time: 0.73333335
      value: {fileID: 21300000, guid: eabccd92608af804a941bf81047b85a4, type: 3}
    - time: 0.75
      value: {fileID: 21300000, guid: e5ebdb08e75173c4b950d32acc1797eb, type: 3}
    - time: 0.76666665
      value: {fileID: 21300000, guid: 161ff04ef8965c74cb39edbf531ed1fe, type: 3}
    - time: 0.78333336
      value: {fileID: 21300000, guid: 87d3c0c0f111acc4281658d5eeeac4ce, type: 3}
    - time: 0.8
      value: {fileID: 21300000, guid: 95dd39d81be5c2a41abff8bf9f1ac497, type: 3}
    - time: 0.81666666
      value: {fileID: 21300000, guid: 55cab5ee1dc4ac84b9a7dba388d164e6, type: 3}
    - time: 0.8333333
      value: {fileID: 21300000, guid: f2ce9cf640fa7ea49a588a12a2876861, type: 3}
    - time: 0.85
      value: {fileID: 21300000, guid: 5bfbdb71ddbba564ea51e15fb5e369ad, type: 3}
    - time: 0.8666667
      value: {fileID: 21300000, guid: 4803f47b94cf9ac4085d737c1cdf587e, type: 3}
    - time: 0.8833333
      value: {fileID: 21300000, guid: 593045fdd1fdd0a46b9c6edbb289377e, type: 3}
    - time: 0.9
      value: {fileID: 21300000, guid: abcd36d171d5ccd48bc683ce21df91c8, type: 3}
    - time: 0.9166667
      value: {fileID: 21300000, guid: a03dfc88ee7bc7f49ae268ec2b3c0f08, type: 3}
    - time: 0.93333334
      value: {fileID: 21300000, guid: e84e9c2e3663bea42a87d7ba1b771ff4, type: 3}
    - time: 0.95
      value: {fileID: 21300000, guid: f862db70d683dfb4e986e4c59cf5c55e, type: 3}
    - time: 0.96666664
      value: {fileID: 21300000, guid: f4699f7f483fd0b4ab4b23c7cbf401aa, type: 3}
    - time: 0.98333335
      value: {fileID: 21300000, guid: 0fe02b217174e8545b51afd3c07dec93, type: 3}
    - time: 1
      value: {fileID: 21300000, guid: a89c2fe7f5ec4834e834747486acc117, type: 3}
    - time: 1.0166667
      value: {fileID: 21300000, guid: efda00d8b89abc74a8c1cff27be63bcd, type: 3}
    attribute: m_Sprite
    path: 
    classID: 212
    script: {fileID: 0}
  m_SampleRate: 60
  m_WrapMode: 0
  m_Bounds:
    m_Center: {x: 0, y: 0, z: 0}
    m_Extent: {x: 0, y: 0, z: 0}
  m_ClipBindingConstant:
    genericBindings:
    - serializedVersion: 2
      path: 0
      attribute: 0
      script: {fileID: 0}
      typeID: 212
      customType: 23
      isPPtrCurve: 1
    pptrCurveMapping:
    - {fileID: 21300000, guid: 0dd9b0606a7876d40910c81dff07f09c, type: 3}
    - {fileID: 21300000, guid: 471fe2b826109de4cb1c82c1b56ba2d2, type: 3}
    - {fileID: 21300000, guid: 980b94b92085054479a334077a030d12, type: 3}
    - {fileID: 21300000, guid: 6a1fd1b47dd65ef45b4667a05ff197fb, type: 3}
    - {fileID: 21300000, guid: 143ef608be9f4cd42867a069456ead9d, type: 3}
    - {fileID: 21300000, guid: 9cb5becf82b10d94998c55ed09b55cb0, type: 3}
    - {fileID: 21300000, guid: 920439e4679ef7246a7902d11d8b3b0b, type: 3}
    - {fileID: 21300000, guid: 82c58c698e6159743baa46bd7ffe2308, type: 3}
    - {fileID: 21300000, guid: c3536d0a8bc3a854c892245df6101529, type: 3}
    - {fileID: 21300000, guid: 33f1b3d51d1ad4b43b1a7d87fa3325f1, type: 3}
    - {fileID: 21300000, guid: ff18747d8b2bc52479bff59b3528a6a5, type: 3}
    - {fileID: 21300000, guid: 56264c2265405fc4b8654af71a979e76, type: 3}
    - {fileID: 21300000, guid: e738a45bcc313544db4a20bc92aa5c0c, type: 3}
    - {fileID: 21300000, guid: 61f622a27a34538488a60c468b1a78ad, type: 3}
    - {fileID: 21300000, guid: 155a81fb98cf70c4cb285b5d22a4cfd4, type: 3}
    - {fileID: 21300000, guid: fdb0589e1e607064ebdabdbe1851261e, type: 3}
    - {fileID: 21300000, guid: a0fad08b3282d3445b138790f3176646, type: 3}
    - {fileID: 21300000, guid: fb554c6b96d033841a542197fcd5d263, type: 3}
    - {fileID: 21300000, guid: 7f5e1c58d6eab8448b81449b8bddc65d, type: 3}
    - {fileID: 21300000, guid: 7615965883759f14bbac379c8537f75b, type: 3}
    - {fileID: 21300000, guid: efe50e6d472424d44b524fa68fd35c5a, type: 3}
    - {fileID: 21300000, guid: ce1507f9cf3569b48a1f3a52fcefecf2, type: 3}
    - {fileID: 21300000, guid: 74e914c38a67a5441bcc5a48f96a441c, type: 3}
    - {fileID: 21300000, guid: d685c934438188b48bf638df77e7c284, type: 3}
    - {fileID: 21300000, guid: 72c05996b0e4d5f47a8a3c0e8d471c65, type: 3}
    - {fileID: 21300000, guid: 733af49444f3ead45ade24286ad7859e, type: 3}
    - {fileID: 21300000, guid: c993a46f732a953419e3501dd19495b0, type: 3}
    - {fileID: 21300000, guid: 68e8becfb1a8abb4d84c6aea0349d5a7, type: 3}
    - {fileID: 21300000, guid: 64d3e2d9f196a2f41b333d26fb6c4eff, type: 3}
    - {fileID: 21300000, guid: 83b69c4f75fcb7f40abfd872074078d8, type: 3}
    - {fileID: 21300000, guid: 47b3d56764373e84a9683c88c7a960f6, type: 3}
    - {fileID: 21300000, guid: a653ac31040bc4e418326a6f5bcb8d60, type: 3}
    - {fileID: 21300000, guid: f30d206dc5ed5244d9af65cc9fc2c735, type: 3}
    - {fileID: 21300000, guid: dbcf30c5800026d4d867ea0d983d1b6d, type: 3}
    - {fileID: 21300000, guid: 32394fac1e60e124eac4cead682b75ee, type: 3}
    - {fileID: 21300000, guid: 6fcddb94e2a4352429eccafb44d37101, type: 3}
    - {fileID: 21300000, guid: ecb730d5da88ed84aa8cbb6ad491c8b0, type: 3}
    - {fileID: 21300000, guid: 701fbb152904ccd4bbe690ad6108fc88, type: 3}
    - {fileID: 21300000, guid: d01d933614440ee448784d0213f856c7, type: 3}
    - {fileID: 21300000, guid: 039b1499d686cb14ca77f40b7aa7cb31, type: 3}
    - {fileID: 21300000, guid: 06fa35b49016f9e4ea0d18685f584bcf, type: 3}
    - {fileID: 21300000, guid: 99f63d1753b6e0143aedda4d6ef3b1ab, type: 3}
    - {fileID: 21300000, guid: 907c40f729cc58149afd4dd60d936858, type: 3}
    - {fileID: 21300000, guid: 25eede48a805a6e4db6ecf2d3f650848, type: 3}
    - {fileID: 21300000, guid: eabccd92608af804a941bf81047b85a4, type: 3}
    - {fileID: 21300000, guid: e5ebdb08e75173c4b950d32acc1797eb, type: 3}
    - {fileID: 21300000, guid: 161ff04ef8965c74cb39edbf531ed1fe, type: 3}
    - {fileID: 21300000, guid: 87d3c0c0f111acc4281658d5eeeac4ce, type: 3}
    - {fileID: 21300000, guid: 95dd39d81be5c2a41abff8bf9f1ac497, type: 3}
    - {fileID: 21300000, guid: 55cab5ee1dc4ac84b9a7dba388d164e6, type: 3}
    - {fileID: 21300000, guid: f2ce9cf640fa7ea49a588a12a2876861, type: 3}
    - {fileID: 21300000, guid: 5bfbdb71ddbba564ea51e15fb5e369ad, type: 3}
    - {fileID: 21300000, guid: 4803f47b94cf9ac4085d737c1cdf587e, type: 3}
    - {fileID: 21300000, guid: 593045fdd1fdd0a46b9c6edbb289377e, type: 3}
    - {fileID: 21300000, guid: abcd36d171d5ccd48bc683ce21df91c8, type: 3}
    - {fileID: 21300000, guid: a03dfc88ee7bc7f49ae268ec2b3c0f08, type: 3}
    - {fileID: 21300000, guid: e84e9c2e3663bea42a87d7ba1b771ff4, type: 3}
    - {fileID: 21300000, guid: f862db70d683dfb4e986e4c59cf5c55e, type: 3}
    - {fileID: 21300000, guid: f4699f7f483fd0b4ab4b23c7cbf401aa, type: 3}
    - {fileID: 21300000, guid: 0fe02b217174e8545b51afd3c07dec93, type: 3}
    - {fileID: 21300000, guid: a89c2fe7f5ec4834e834747486acc117, type: 3}
    - {fileID: 21300000, guid: efda00d8b89abc74a8c1cff27be63bcd, type: 3}
  m_AnimationClipSettings:
    serializedVersion: 2
    m_AdditiveReferencePoseClip: {fileID: 0}
    m_AdditiveReferencePoseTime: 0
    m_StartTime: 0
    m_StopTime: 1.0333333
    m_OrientationOffsetY: 0
    m_Level: 0
    m_CycleOffset: 0
    m_HasAdditiveReferencePose: 0
    m_LoopTime: 1
    m_LoopBlend: 0
    m_LoopBlendOrientation: 0
    m_LoopBlendPositionY: 0
    m_LoopBlendPositionXZ: 0
    m_KeepOriginalOrientation: 0
    m_KeepOriginalPositionY: 1
    m_KeepOriginalPositionXZ: 0
    m_HeightFromFeet: 0
    m_Mirror: 0
  m_EditorCurves: []
  m_EulerEditorCurves: []
  m_HasGenericRootTransform: 0
  m_HasMotionFloatCurves: 0
  m_Events: []
