%YAML 1.1
%TAG !u! tag:unity3d.com,2011:
--- !u!74 &7400000
AnimationClip:
  m_ObjectHideFlags: 0
  m_CorrespondingSourceObject: {fileID: 0}
  m_PrefabInstance: {fileID: 0}
  m_PrefabAsset: {fileID: 0}
  m_Name: Fly
  serializedVersion: 6
  m_Legacy: 0
  m_Compressed: 0
  m_UseHighQualityCurve: 1
  m_RotationCurves: []
  m_CompressedRotationCurves: []
  m_EulerCurves: []
  m_PositionCurves: []
  m_ScaleCurves: []
  m_FloatCurves: []
  m_PPtrCurves:
  - curve:
    - time: 0
      value: {fileID: 21300000, guid: 9406b428fc9311c45bccc0c96c253c05, type: 3}
    - time: 0.016666668
      value: {fileID: 21300000, guid: 5fb60d1d1905fff4380631f6c993ed46, type: 3}
    - time: 0.033333335
      value: {fileID: 21300000, guid: c0cd571a95b8dbd49875c37a34f8a0b6, type: 3}
    - time: 0.05
      value: {fileID: 21300000, guid: 6931c299fd2a0b948a83d48f115eff58, type: 3}
    - time: 0.06666667
      value: {fileID: 21300000, guid: a8b511206f8a6d044ae52b7cc38803f3, type: 3}
    - time: 0.083333336
      value: {fileID: 21300000, guid: 1a14fba8009cdb94287a8d4f2d4affc0, type: 3}
    - time: 0.1
      value: {fileID: 21300000, guid: d8db2ff427cf9cb4f943a8f32a0cf020, type: 3}
    - time: 0.11666667
      value: {fileID: 21300000, guid: e857a4d52e00ad84cb4b77cd90d4f98e, type: 3}
    - time: 0.13333334
      value: {fileID: 21300000, guid: e9b965270cbca634586a6146f96f502f, type: 3}
    - time: 0.15
      value: {fileID: 21300000, guid: b537ff75f7ca9b24a906b7ff1ed22335, type: 3}
    - time: 0.16666667
      value: {fileID: 21300000, guid: ec1a32785860fbb4f8196d81be196d8b, type: 3}
    - time: 0.18333334
      value: {fileID: 21300000, guid: 1f027913fb4a1b74a9f1d77bd67bdd3b, type: 3}
    - time: 0.2
      value: {fileID: 21300000, guid: 9e9c23fe85cb23a4eb813848b801caba, type: 3}
    - time: 0.21666667
      value: {fileID: 21300000, guid: 95348c2331575c14b832eac497ed4569, type: 3}
    - time: 0.23333333
      value: {fileID: 21300000, guid: 93b46705304a7c44e8e17b1f4a9b46ca, type: 3}
    - time: 0.25
      value: {fileID: 21300000, guid: cdd247489435b464d9c97cfc8f9338b4, type: 3}
    - time: 0.26666668
      value: {fileID: 21300000, guid: 57e02a766b7a8ae4c877a54c9d6dd25f, type: 3}
    - time: 0.28333333
      value: {fileID: 21300000, guid: 5b8cedc9d0422ed4f8ca19e6cf23af1a, type: 3}
    - time: 0.3
      value: {fileID: 21300000, guid: 070bf410b6145bb4db0d351938c68e04, type: 3}
    - time: 0.31666666
      value: {fileID: 21300000, guid: 79a01c0a719564d4f867547b05a2a251, type: 3}
    - time: 0.33333334
      value: {fileID: 21300000, guid: db0e4b55b81961a4bbc1068535c37d51, type: 3}
    - time: 0.35
      value: {fileID: 21300000, guid: 83d69071f421be249b9592991b6e9a5f, type: 3}
    - time: 0.36666667
      value: {fileID: 21300000, guid: 870efc4fc6732884599b09cb85b6d29e, type: 3}
    - time: 0.38333333
      value: {fileID: 21300000, guid: 75e29e6221e984d44867cbbbb8f1482e, type: 3}
    - time: 0.4
      value: {fileID: 21300000, guid: 262f9792a1a95f349a4b1499bdffc175, type: 3}
    - time: 0.41666666
      value: {fileID: 21300000, guid: 429ec43c1c727e949a60816a6845ad68, type: 3}
    - time: 0.43333334
      value: {fileID: 21300000, guid: 9c3d2b6096c2c154b88236ec02b9f904, type: 3}
    - time: 0.45
      value: {fileID: 21300000, guid: 0a60ed0999e8c4f4eb10112e5fbde7f6, type: 3}
    - time: 0.46666667
      value: {fileID: 21300000, guid: ef1acfafeef0b2040af5b840e2bd8d8d, type: 3}
    - time: 0.48333332
      value: {fileID: 21300000, guid: bfd0a349a2bd37d48873768202d21fb6, type: 3}
    - time: 0.5
      value: {fileID: 21300000, guid: 08f146b1eba70d14d8275b55ab1aad3d, type: 3}
    - time: 0.51666665
      value: {fileID: 21300000, guid: a7b9a72a81f899a4bb977bb0cc5fa0ad, type: 3}
    - time: 0.53333336
      value: {fileID: 21300000, guid: 123ce7d3e3346a24da6fd1d289621fb4, type: 3}
    - time: 0.55
      value: {fileID: 21300000, guid: 22bd831b04b29824c969d08bc18c2b51, type: 3}
    - time: 0.56666666
      value: {fileID: 21300000, guid: b7acc2a434d24b4459c59a1ae650efbd, type: 3}
    - time: 0.5833333
      value: {fileID: 21300000, guid: c5f32137266f6e9419cc2106e87ba29a, type: 3}
    - time: 0.6
      value: {fileID: 21300000, guid: 05526049038535249b4223de8ecc3b1c, type: 3}
    - time: 0.6166667
      value: {fileID: 21300000, guid: b62549864dcaa3e4dbc301c4bc0b04d2, type: 3}
    - time: 0.6333333
      value: {fileID: 21300000, guid: 7dbd9bf934817ae4b99bc0e917e57d1f, type: 3}
    - time: 0.65
      value: {fileID: 21300000, guid: 9c3e1fbc17166a442b3033802a1131c1, type: 3}
    - time: 0.6666667
      value: {fileID: 21300000, guid: 619f07ce739cbfd488767313c2a10fd6, type: 3}
    - time: 0.68333334
      value: {fileID: 21300000, guid: a864f3e18dd01474b808eff711e7aa06, type: 3}
    - time: 0.7
      value: {fileID: 21300000, guid: 3265e0d8b7d466f448fae8712ea77547, type: 3}
    - time: 0.71666664
      value: {fileID: 21300000, guid: b6be5d134382e8e4fb601596aeb607f8, type: 3}
    - time: 0.73333335
      value: {fileID: 21300000, guid: eef8811316bf9c34dade4e21dbf37306, type: 3}
    - time: 0.75
      value: {fileID: 21300000, guid: 14da35f2bcafd5b4eb3db02835472df2, type: 3}
    - time: 0.76666665
      value: {fileID: 21300000, guid: 8a58f8cb983593a4da5cd7c847752920, type: 3}
    - time: 0.78333336
      value: {fileID: 21300000, guid: 8619ea4471c81714f825a1d9c857c51c, type: 3}
    - time: 0.8
      value: {fileID: 21300000, guid: 4f512722bf1b2514fb705e285b50b250, type: 3}
    - time: 0.81666666
      value: {fileID: 21300000, guid: e2a05ab71cb32924aac14a33921aad98, type: 3}
    - time: 0.8333333
      value: {fileID: 21300000, guid: e03c0573546a8984cbf31ecefedbace6, type: 3}
    - time: 0.85
      value: {fileID: 21300000, guid: e6618dd440e65634fb4527450025cc3d, type: 3}
    - time: 0.8666667
      value: {fileID: 21300000, guid: 12b0f8b982de52f498e5af51b5c700ce, type: 3}
    - time: 0.8833333
      value: {fileID: 21300000, guid: 68a8a12562cfa7649b8cd97a084fec33, type: 3}
    - time: 0.9
      value: {fileID: 21300000, guid: 3393c6a5ad70350409c2882dbf1fcc05, type: 3}
    - time: 0.9166667
      value: {fileID: 21300000, guid: 799ab781711b70048bab5afc18c3368d, type: 3}
    - time: 0.93333334
      value: {fileID: 21300000, guid: d8c79b323ff27da43bcb47013aa8ed6d, type: 3}
    - time: 0.95
      value: {fileID: 21300000, guid: 020cc2cc281301e438cfab60ff79466f, type: 3}
    - time: 0.96666664
      value: {fileID: 21300000, guid: 1ad98de63df69484cbc825491d08ad2c, type: 3}
    - time: 0.98333335
      value: {fileID: 21300000, guid: 1eeab7394d2b6f840a77f22db094aeef, type: 3}
    - time: 1
      value: {fileID: 21300000, guid: 3ccea6f17a401334595085ea13f801d7, type: 3}
    - time: 1.0166667
      value: {fileID: 21300000, guid: 261da6afd794e984dad20734ba889709, type: 3}
    attribute: m_Sprite
    path: 
    classID: 212
    script: {fileID: 0}
  m_SampleRate: 60
  m_WrapMode: 0
  m_Bounds:
    m_Center: {x: 0, y: 0, z: 0}
    m_Extent: {x: 0, y: 0, z: 0}
  m_ClipBindingConstant:
    genericBindings:
    - serializedVersion: 2
      path: 0
      attribute: 0
      script: {fileID: 0}
      typeID: 212
      customType: 23
      isPPtrCurve: 1
    pptrCurveMapping:
    - {fileID: 21300000, guid: 9406b428fc9311c45bccc0c96c253c05, type: 3}
    - {fileID: 21300000, guid: 5fb60d1d1905fff4380631f6c993ed46, type: 3}
    - {fileID: 21300000, guid: c0cd571a95b8dbd49875c37a34f8a0b6, type: 3}
    - {fileID: 21300000, guid: 6931c299fd2a0b948a83d48f115eff58, type: 3}
    - {fileID: 21300000, guid: a8b511206f8a6d044ae52b7cc38803f3, type: 3}
    - {fileID: 21300000, guid: 1a14fba8009cdb94287a8d4f2d4affc0, type: 3}
    - {fileID: 21300000, guid: d8db2ff427cf9cb4f943a8f32a0cf020, type: 3}
    - {fileID: 21300000, guid: e857a4d52e00ad84cb4b77cd90d4f98e, type: 3}
    - {fileID: 21300000, guid: e9b965270cbca634586a6146f96f502f, type: 3}
    - {fileID: 21300000, guid: b537ff75f7ca9b24a906b7ff1ed22335, type: 3}
    - {fileID: 21300000, guid: ec1a32785860fbb4f8196d81be196d8b, type: 3}
    - {fileID: 21300000, guid: 1f027913fb4a1b74a9f1d77bd67bdd3b, type: 3}
    - {fileID: 21300000, guid: 9e9c23fe85cb23a4eb813848b801caba, type: 3}
    - {fileID: 21300000, guid: 95348c2331575c14b832eac497ed4569, type: 3}
    - {fileID: 21300000, guid: 93b46705304a7c44e8e17b1f4a9b46ca, type: 3}
    - {fileID: 21300000, guid: cdd247489435b464d9c97cfc8f9338b4, type: 3}
    - {fileID: 21300000, guid: 57e02a766b7a8ae4c877a54c9d6dd25f, type: 3}
    - {fileID: 21300000, guid: 5b8cedc9d0422ed4f8ca19e6cf23af1a, type: 3}
    - {fileID: 21300000, guid: 070bf410b6145bb4db0d351938c68e04, type: 3}
    - {fileID: 21300000, guid: 79a01c0a719564d4f867547b05a2a251, type: 3}
    - {fileID: 21300000, guid: db0e4b55b81961a4bbc1068535c37d51, type: 3}
    - {fileID: 21300000, guid: 83d69071f421be249b9592991b6e9a5f, type: 3}
    - {fileID: 21300000, guid: 870efc4fc6732884599b09cb85b6d29e, type: 3}
    - {fileID: 21300000, guid: 75e29e6221e984d44867cbbbb8f1482e, type: 3}
    - {fileID: 21300000, guid: 262f9792a1a95f349a4b1499bdffc175, type: 3}
    - {fileID: 21300000, guid: 429ec43c1c727e949a60816a6845ad68, type: 3}
    - {fileID: 21300000, guid: 9c3d2b6096c2c154b88236ec02b9f904, type: 3}
    - {fileID: 21300000, guid: 0a60ed0999e8c4f4eb10112e5fbde7f6, type: 3}
    - {fileID: 21300000, guid: ef1acfafeef0b2040af5b840e2bd8d8d, type: 3}
    - {fileID: 21300000, guid: bfd0a349a2bd37d48873768202d21fb6, type: 3}
    - {fileID: 21300000, guid: 08f146b1eba70d14d8275b55ab1aad3d, type: 3}
    - {fileID: 21300000, guid: a7b9a72a81f899a4bb977bb0cc5fa0ad, type: 3}
    - {fileID: 21300000, guid: 123ce7d3e3346a24da6fd1d289621fb4, type: 3}
    - {fileID: 21300000, guid: 22bd831b04b29824c969d08bc18c2b51, type: 3}
    - {fileID: 21300000, guid: b7acc2a434d24b4459c59a1ae650efbd, type: 3}
    - {fileID: 21300000, guid: c5f32137266f6e9419cc2106e87ba29a, type: 3}
    - {fileID: 21300000, guid: 05526049038535249b4223de8ecc3b1c, type: 3}
    - {fileID: 21300000, guid: b62549864dcaa3e4dbc301c4bc0b04d2, type: 3}
    - {fileID: 21300000, guid: 7dbd9bf934817ae4b99bc0e917e57d1f, type: 3}
    - {fileID: 21300000, guid: 9c3e1fbc17166a442b3033802a1131c1, type: 3}
    - {fileID: 21300000, guid: 619f07ce739cbfd488767313c2a10fd6, type: 3}
    - {fileID: 21300000, guid: a864f3e18dd01474b808eff711e7aa06, type: 3}
    - {fileID: 21300000, guid: 3265e0d8b7d466f448fae8712ea77547, type: 3}
    - {fileID: 21300000, guid: b6be5d134382e8e4fb601596aeb607f8, type: 3}
    - {fileID: 21300000, guid: eef8811316bf9c34dade4e21dbf37306, type: 3}
    - {fileID: 21300000, guid: 14da35f2bcafd5b4eb3db02835472df2, type: 3}
    - {fileID: 21300000, guid: 8a58f8cb983593a4da5cd7c847752920, type: 3}
    - {fileID: 21300000, guid: 8619ea4471c81714f825a1d9c857c51c, type: 3}
    - {fileID: 21300000, guid: 4f512722bf1b2514fb705e285b50b250, type: 3}
    - {fileID: 21300000, guid: e2a05ab71cb32924aac14a33921aad98, type: 3}
    - {fileID: 21300000, guid: e03c0573546a8984cbf31ecefedbace6, type: 3}
    - {fileID: 21300000, guid: e6618dd440e65634fb4527450025cc3d, type: 3}
    - {fileID: 21300000, guid: 12b0f8b982de52f498e5af51b5c700ce, type: 3}
    - {fileID: 21300000, guid: 68a8a12562cfa7649b8cd97a084fec33, type: 3}
    - {fileID: 21300000, guid: 3393c6a5ad70350409c2882dbf1fcc05, type: 3}
    - {fileID: 21300000, guid: 799ab781711b70048bab5afc18c3368d, type: 3}
    - {fileID: 21300000, guid: d8c79b323ff27da43bcb47013aa8ed6d, type: 3}
    - {fileID: 21300000, guid: 020cc2cc281301e438cfab60ff79466f, type: 3}
    - {fileID: 21300000, guid: 1ad98de63df69484cbc825491d08ad2c, type: 3}
    - {fileID: 21300000, guid: 1eeab7394d2b6f840a77f22db094aeef, type: 3}
    - {fileID: 21300000, guid: 3ccea6f17a401334595085ea13f801d7, type: 3}
    - {fileID: 21300000, guid: 261da6afd794e984dad20734ba889709, type: 3}
  m_AnimationClipSettings:
    serializedVersion: 2
    m_AdditiveReferencePoseClip: {fileID: 0}
    m_AdditiveReferencePoseTime: 0
    m_StartTime: 0
    m_StopTime: 1.0333333
    m_OrientationOffsetY: 0
    m_Level: 0
    m_CycleOffset: 0
    m_HasAdditiveReferencePose: 0
    m_LoopTime: 1
    m_LoopBlend: 0
    m_LoopBlendOrientation: 0
    m_LoopBlendPositionY: 0
    m_LoopBlendPositionXZ: 0
    m_KeepOriginalOrientation: 0
    m_KeepOriginalPositionY: 1
    m_KeepOriginalPositionXZ: 0
    m_HeightFromFeet: 0
    m_Mirror: 0
  m_EditorCurves: []
  m_EulerEditorCurves: []
  m_HasGenericRootTransform: 0
  m_HasMotionFloatCurves: 0
  m_Events: []
