version="1.9.3"
tags={
	"Alternative History"
	"Events"
	"Map"
	"National Focuses"
}
replace_path = "common/ideas"
replace_path = "events"
replace_path = "common/national_focus"
replace_path = "common/decisions"
replace_path = "common/decisions/categories"
replace_path = "common/ai_strategy"
replace_path = "common/ai_strategy_plans"
replace_path = "common/ai_focuses"
replace_path = "history/states"
replace_path = "map"
name="Red Liberty"
supported_version="1.10.1"
