add_namespace = ahe_events
add_namespace = danubian_war_events

####################
##	 Danubian War events ## 
################### 

#Ukrainian Intervetion
country_event = {
	id = danubian_war_events.5
	title = danubian_war_events.5.t
	desc = danubian_war_events.5.d
	picture = GFX_report_event_austro_hungarian_split

	is_triggered_only = yes

	fire_only_once = yes 

	option = { 
		ai_chance = { factor = 50 }
		name = "Time to Take Back our Rightful Land!" 
		declare_war_on = {
    		target = AHE
    		type = take_state_focus 
			generator = { 91 }
		}
		set_country_flag = danubian_war_participant
		add_ideas = {
			DAN_danubian_war_participant
		}
	} 

	option = { 
		ai_chance = { factor = 25 }
		name = "Best That we remain Neutral" 
		add_political_power = 50  	
	}
} 

#Romanian Intervetion
country_event = {
	id = danubian_war_events.4
	title = danubian_war_events.4.t
	desc = danubian_war_events.4.d
	picture = GFX_report_event_partition_of_austria_hungary

	is_triggered_only = yes

	fire_only_once = yes 

	option = { 
		ai_chance = { factor = 50 }
		name = "Time to Take Back our Rightful Land!" 
		declare_war_on = {
    		target = HSR
    		type = take_state_focus 
			generator = { 82 83 84 76 }
		}
		declare_war_on = {
    		target = HUN
    		type = take_state_focus 
			generator = { 82 83 84 76 }
		}
		declare_war_on = {
    		target = AHE
    		type = take_state_focus 
			generator = { 80 }
		}
		set_country_flag = danubian_war_participant
	} 

	option = { 
		ai_chance = { factor = 25 }
		name = "Best That we remain Neutral" 
		add_political_power = 50  	
	}
}  

#Polish Intervetion
country_event = {
	id = danubian_war_events.3
	title = danubian_war_events.3.t
	desc = danubian_war_events.3.d
	picture = GFX_report_event_partition_of_austria_hungary

	is_triggered_only = yes

	fire_only_once = yes 

	option = { 
		ai_chance = { factor = 50 }
		name = "Time to Take Back our Rightful Land!" 
		declare_war_on = {
    		target = AHE
    		type = take_state_focus 
			generator = { 88 }
		}
		set_country_flag = danubian_war_participant
		add_ideas = {
			DAN_danubian_war_participant
		}
	} 

	option = { 
		ai_chance = { factor = 25 }
		name = "Best That we Remain Nuetral" 
		add_political_power = 50  	
	}
} 

#German Intervetion
country_event = {
	id = danubian_war_events.2
	title = danubian_war_events.2.t
	desc = danubian_war_events.2.d
	picture = GFX_report_event_partition_of_austria_hungary

	is_triggered_only = yes

	fire_only_once = yes 

	option = { 
		ai_chance = { factor = 50 }
		name = "The Sudantenland was Always German!" 
		transfer_state = 69
	} 

	option = { 
		ai_chance = { factor = 25 }
		name = "Best That we Remain Nuetral" 
		add_political_power = 50  	
	}
}   

#Italian Intervetion
country_event = {
	id = danubian_war_events.1
	title = danubian_war_events.1.t
	desc = danubian_war_events.1.d
	picture = GFX_report_event_partition_of_austria_hungary

	is_triggered_only = yes

	fire_only_once = yes 

	option = { 
		ai_chance = { factor = 50 }
		name = "This Will be a Great Time to Strike!" 
		declare_war_on = {
    		target = AHE
    		type = take_state_focus 
			generator = { 39 736 163 798 }
		}
		set_country_flag = danubian_war_participant
	} 

	option = { 
		ai_chance = { factor = 25 }
		name = "Best That we Remain Nuetral" 
		add_political_power = 50  	
	}
}  

####################
##	 AHE events ## 
################### 

#Slovaks Revolt
country_event = {
	id = ahe_events.6
	title = ahe_events.6.t
	desc = ahe_events.6.d
	picture = GFX_report_event_revolutions

	is_triggered_only = yes

	fire_only_once = yes 

	option = { 
		ai_chance = { factor = 1 }
		name = "The Slovaks have Rebelled and we Have to Stop That" 
		add_political_power = 20 
		SLO = {
			transfer_state = 70	
			declare_war_on = {
    			target = HUN
    			type = take_state_focus 
				generator = { 71 }
			}
		} 		
	} 

	option = { 
		ai_chance = { factor = 0 }
		name = "Switch to the Slovaks" 
		SLO = { change_tag_from = ROOT } 
		SLO = {
			transfer_state = 70 
			declare_war_on = {
    			target = HUN
    			type = take_state_focus 
				generator = { 71 }
			}
		} 	
	}
} 

#Serbia Attacks
country_event = {
	id = ahe_events.7
	title = ahe_events.7.t
	desc = ahe_events.7.d
	picture = GFX_report_event_revolutions

	is_triggered_only = yes

	fire_only_once = yes
	
	immediate = {
		
	}

	option = { 
		ai_chance = { factor = 1 }
		name = "The Old Rival is Back" 
		add_political_power = 20 
		SER = {
			declare_war_on = {
    			target = AHE
    			type = take_state_focus 
				generator = { 105 }
			}
			declare_war_on = {
    			target = BOS
    			type = annex_everything
			}
		} 		
	} 

	option = { 
		ai_chance = { factor = 0 }
		name = "Switch to the Serbs" 
		SER = { change_tag_from = AHE } 
		SER = {
			declare_war_on = {
    			target = AHE
    			type = take_state_focus 
				generator = { 105 }
			}
			declare_war_on = {
    			target = BOS
    			type = annex_everything
			}
		} 	
	}
}

#Czechs Revolt
country_event = {
	id = ahe_events.5
	title = ahe_events.5.t
	desc = ahe_events.5.d
	picture = GFX_report_event_revolutions

	is_triggered_only = yes

	fire_only_once = yes
	
	immediate = {
		hidden_effect = {
			CZE = {
				transfer_state = 9	
			}
			AHE = {
				declare_war_on = {
					target = CZE
					type = annex_everything
				}
			}
			GER ={
				country_event = { id = danubian_war_events.2 days = 2 }
			}
		}
	}

	option = { 
		ai_chance = { factor = 1 }
		name = "Things are Getting Worse" 
		add_political_power = 20 
	} 

	option = { 
		ai_chance = { factor = 0 }
		name = "Switch to the Czechs" 
		CZE = { change_tag_from = AHE } 
	}
}

#Croatia revolts
country_event = {
	id = ahe_events.4
	title = ahe_events.4.t
	desc = ahe_events.4.d
	picture = GFX_report_event_revolutions

	is_triggered_only = yes

	fire_only_once = yes
	
	immediate = {
		hidden_effect = {
			CRO = {
				transfer_state = 103
				transfer_state = 109
			}
			GER = {
				remove_from_faction = AHE
			}
			ITA ={
				country_event = { id = danubian_war_events.1 days = 10 }
			} 
			ROM ={
				country_event = { id = danubian_war_events.4 days = 10 }
			} 
			POL ={
				country_event = { id = danubian_war_events.3 days = 10 }
			} 
			UKR ={
				country_event = { id = danubian_war_events.5 days = 10 }
			}
		}
	}

	option = { 
		ai_chance = { factor = 1 }
		name = "Things Can't get Any Worse!" 
		add_political_power = 20 
		HUN = {
			declare_war_on = {
    			target = CRO
    			type = annex_everything
			}	
		} 
	} 

	option = { 
		ai_chance = { factor = 0 }
		name = "Switch to the Croations" 
		CRO = { change_tag_from = HUN } 
		HUN = {
			declare_war_on = {
    			target = CRO
    			type = annex_everything
			}	
		}
	}
} 

#Start of the Danubian wars
country_event = {
	id = ahe_events.3
	title = ahe_events.3.t
	desc = ahe_events.3.d
	picture = GFX_report_event_revolutions

	is_triggered_only = yes

	fire_only_once = yes
	
	immediate = {
		hidden_effect = {
			BOS = {
				transfer_state = 104	
			}
		}
	}

	option = { 
		ai_chance = { factor = 1 }
		name = "Off for some war crimes!" 
		add_political_power = 20 
		hidden_effect = { 
			HUN ={
				country_event = { id = ahe_events.4 days = 10 }
			} 
			AHE = {
				country_event = { id = ahe_events.5 days = 10 } 
				country_event = { id = ahe_events.6 days = 13 } 
				country_event = { id = ahe_events.7 days = 17 }
			}
		}		
	} 

	option = { 
		ai_chance = { factor = 0 }
		name = "Switch to the Bosnians" 
		BOS = { change_tag_from = AHE } 
		hidden_effect = { 
			HUN ={
				country_event = { id = ahe_events.4 days = 10 }
			}
		}	
	}
} 

#Communist uprising in Hungary 
country_event = {
	id = ahe_events.2
	title = ahe_events.2.t
	desc = ahe_events.2.d
	picture = GFX_report_event_revolutions

	is_triggered_only = yes

	fire_only_once = yes 
	
	immediate = {
		hidden_effect = {
			HSR = {
				transfer_state = 45
				transfer_state = 764 
				transfer_state = 82 
				transfer_state = 83 
				transfer_state = 84 
				transfer_state = 76 
				transfer_state = 154
				
				set_country_flag = danubian_war_participant
			}
			AHE = {
				country_event = { id = ahe_events.3 days = 10}				
			}
		}
	}

	option = { 
		ai_chance = { factor = 100 }
		name = "Hungary will Never fall to Communism!"
		declare_war_on = {
    		target = HSR
    		type = annex_everything
		}
	} 

	option = { 
		ai_chance = { factor = 0 }
		name = "The Revolution to Free the People!" 
		HSR = { change_tag_from = HUN }
		declare_war_on = {
    		target = HSR
    		type = annex_everything
		} 
	} 
} 

#Collapse of AHE
country_event = {
	id = ahe_events.1
	title = ahe_events.1.t
	desc = ahe_events.1.d
	picture = GFX_report_event_austro_hungarian_split

	is_triggered_only = yes

	fire_only_once = yes 

	immediate = {
		hidden_effect = {
			news_event = { id = redliberties.3 days = 1 }
			HUN = {
				country_event = { id = ahe_events.2 days = 30 }
			}
			HUN = { 
				transfer_state = 103
				transfer_state = 109
				transfer_state = 83 
				transfer_state = 84 
				transfer_state = 76 
				transfer_state = 82 
				transfer_state = 764 
				transfer_state = 45 
				transfer_state = 155 
				transfer_state = 154 
				transfer_state = 43 
				transfer_state = 664 
				transfer_state = 70 
				transfer_state = 71 
				transfer_state = 73
				
				set_country_flag = danubian_war_participant
			}
			AHE = {
				end_puppet = UKR
				end_puppet = SER
				end_puppet = ROM
			}
			SER = {
				leave_faction = yes
			}
			ROM = {
				leave_faction = yes
			}
		}
	}

	option = { 
		ai_chance = { factor = 1 }
		name = "The Union was doomed from the beginning." 
		add_political_power = 20
		set_country_flag = danubian_war_participant
	} 

	option = { 
		ai_chance = { factor = 0 }
		name = "For a free Hungary!" 
		HUN = { change_tag_from = AHE }
		add_political_power = 20
		set_country_flag = danubian_war_participant
	}
}
