<story path="stories/TC_01_LogIn.story" title="">
<narrative keyword="Narrative:">
  <inOrderTo keyword="As a">user</inOrderTo>
  <asA keyword="I want to">be able to log in to school forum</asA>
  <iWantTo keyword="So that">I can create posts, comment and send messages</iWantTo>
</narrative>
<scenario keyword="Scenario:" title="I want to log in to Telerik Academy&apos;s school forum">
<step outcome="successful">Given element <parameter>logInForumButton</parameter> is present</step>
<step outcome="successful">When click <parameter>logInForumButton</parameter> element</step>
<step outcome="successful">And type <parameter>username</parameter> in <parameter>signInNameField</parameter> field</step>
<step outcome="successful">And type <parameter>password</parameter> in <parameter>passwordInputField</parameter> field</step>
<step outcome="successful">And click <parameter>signInFormButton</parameter> element</step>
<step outcome="successful">Then element <parameter>schoolForumLogo</parameter> is present</step>
</scenario>
</story>
