{
	"id": "d3297955-230e-4da2-8eab-467b52dc4f9b",
	"values": [
		{
			"key": "userId",
			"value": "1",
			"enabled": true
		},
		{
			"key": "postId",
			"value": "2",
			"enabled": true
		},
		{
			"key": "commentId",
			"value": "12",
			"enabled": true
		},
		{
			"key": "receiverId",
			"value": "1",
			"enabled": true
		},
		{
			"key": "senderId",
			"value": "3",
			"enabled": true
		},
		{
			"key": "mypostId",
			"value": "7",
			"enabled": true
		}
	],
	"name": "HitNet Globals",
	"_postman_variable_scope": "globals",
	"_postman_exported_at": "2019-11-18T09:16:41.823Z",
	"_postman_exported_using": "Postman/7.11.0"
}