{
	"id": "b1f0a077-3569-4601-bfa8-6795b99a7a2f",
	"name": "UserURL",
	"values": [
		{
			"key": "UserURL",
			"value": "localhost:8080/api/users",
			"enabled": true
		}
	],
	"_postman_variable_scope": "environment",
	"_postman_exported_at": "2019-11-19T16:51:31.256Z",
	"_postman_exported_using": "Postman/7.11.0"
}