{
	"id": "c9eef32f-19d9-44d2-8ed4-cd23356f698f",
	"name": "CommentURL",
	"values": [
		{
			"key": "baseUrl",
			"value": "localhost:8080",
			"enabled": false
		},
		{
			"key": "commentURL",
			"value": "localhost:8080/api/comments",
			"enabled": true
		}
	],
	"_postman_variable_scope": "environment",
	"_postman_exported_at": "2019-11-19T16:50:57.992Z",
	"_postman_exported_using": "Postman/7.11.0"
}