{
	"id": "f0157a25-4619-4fb0-941a-6a102546e33a",
	"name": "PostURL",
	"values": [
		{
			"key": "postURL",
			"value": "localhost:8080/api/posts",
			"enabled": true
		}
	],
	"_postman_variable_scope": "environment",
	"_postman_exported_at": "2019-11-18T10:37:36.760Z",
	"_postman_exported_using": "Postman/7.11.0"
}