{
  "data": [
    {
      "img": "./img/process/1.png",
      "title": "Оценка объема предстоящих работ",
      "desc": "Стоимость переезда зависит от количества комнат, вещей и мебели."
    },
    {
      "img": "./img/process/2.png",
      "title": "Упаковка вещей",
      "desc": "Упаковываем вещи в коробки, подписываем. Габаритное и деликатное, упаковываем отдельно."
    },
    {
      "img": "./img/process/3.png",
      "title": "Погрузка и транспортировка вещей",
      "desc": "В нашем автопарке имеются машины, подходящие для мебели любых габаритов."
    },
    {
      "img": "./img/process/4.png",
      "title": "Распаковка и расстановка мебели",
      "desc": "Опытные грузчики быстро расставят мебель и уберут мусор от распаковки."
    }
  ],
  "orders": [
    {
      "name": "Aleksey",
      "phone": "asdfsdaf",
      "agree": true,
      "id": 1
    },
    {
      "name": "Aleksey",
      "phone": "89600133315",
      "agree": true,
      "id": 2
    },
    {
      "name": "Aleksey",
      "phone": "asdfsdaf",
      "agree": true,
      "id": 3
    }
  ]
}