C:\Users\aleks\Desktop\finalProject\src\test\java\runner\Runner.java
C:\Users\aleks\Desktop\finalProject\src\test\java\testCases\PostTests.java
C:\Users\aleks\Desktop\finalProject\src\test\java\testCases\BaseTest.java
C:\Users\aleks\Desktop\finalProject\src\test\java\testCases\CategoryTests.java
C:\Users\aleks\Desktop\finalProject\src\test\java\stepdefinitions\StepDefinitions.java
C:\Users\aleks\Desktop\finalProject\src\test\java\stepdefinitions\BaseStepDefinitions.java
C:\Users\aleks\Desktop\finalProject\src\test\java\testCases\ConnectionTests.java
C:\Users\aleks\Desktop\finalProject\src\test\java\reporter\JbehaveStoryReporter.java
C:\Users\aleks\Desktop\finalProject\src\test\java\testCases\CommentsTests.java
C:\Users\aleks\Desktop\finalProject\src\test\java\testCases\FunctionalTesting.java
