<?xml version="1.0" standalone="no"?>
<!DOCTYPE svg PUBLIC "-//W3C//DTD SVG 1.1//EN" "http://www.w3.org/Graphics/SVG/1.1/DTD/svg11.dtd" >
<svg xmlns="http://www.w3.org/2000/svg">
<metadata>Generated by IcoMoon</metadata>
<defs>
<font id="icomoon" horiz-adv-x="512">
<font-face units-per-em="512" ascent="480" descent="-32" />
<missing-glyph horiz-adv-x="512" />
<glyph unicode="&#x20;" d="" horiz-adv-x="256" />
<glyph unicode="&#xe600;" d="M432 480h-384c-26.4 0-48-21.6-48-48v-416c0-26.4 21.6-48 48-48h384c26.4 0 48 21.6 48 48v416c0 26.4-21.6 48-48 48zM416 32h-352v384h352v-384zM128 256h224v-32h-224zM128 192h224v-32h-224zM128 128h224v-32h-224zM128 320h224v-32h-224z" />
<glyph unicode="&#xe601;" d="M0 224c0-141.385 114.615-256 256-256s256 114.615 256 256-114.614 256-256 256c-141.385 0-256-114.615-256-256zM448 224c0-36.618-10.256-70.84-28.044-99.956l-263.911 263.912c29.115 17.789 63.337 28.044 99.955 28.044 106.038 0 192-85.961 192-192zM64 224c0 36.618 10.256 70.839 28.045 99.956l263.911-263.912c-29.117-17.789-63.338-28.044-99.956-28.044-106.038 0-192 85.961-192 192z" />
<glyph unicode="&#xe602;" d="M248 424c-114.88 0-208-93.12-208-208s93.12-208 208-208 208 93.12 208 208-93.12 208-208 208zM248 98c-13.264 0-24 10.752-24 24s10.736 24 24 24c13.248 0 24-10.752 24-24s-10.752-24-24-24zM272 202c0-13.248-10.752-24-24-24-13.264 0-24 10.752-24 24v112c0 13.264 10.736 24 24 24 13.248 0 24-10.736 24-24v-112z" />
<glyph unicode="&#xe607;" d="M64 320v-64h-64v64h64zM0 416c0 35.328 28.672 64 64 64h32v-64c-17.696 0-32-14.304-32-32h-64v32zM160 416v64h64v-64h-64zM64 64c0-17.696 14.304-32 32-32v-64h-32c-35.328 0-64 28.672-64 64v32h64zM64 192v-64h-64v64h64zM160-32v64h64v-64h-64zM448 256v64h64v-64h-64zM288-32v64h64v-64h-64zM448 480c35.328 0 64-28.672 64-64v-32h-64c0 17.696-14.304 32-32 32v64h32zM448 128v64h64v-64h-64zM416 32c17.696 0 32 14.304 32 32h64v-32c0-35.328-28.672-64-64-64h-32v64zM288 416v64h64v-64h-64z" />
<glyph unicode="&#xf14a;" d="M0 82.286v274.286q0 34 24.143 58.143t58.143 24.143h274.286q34 0 58.143-24.143t24.143-58.143v-274.286q0-34-24.143-58.143t-58.143-24.143h-274.286q-34 0-58.143 24.143t-24.143 58.143zM62.285 219.429q0-7.428 5.428-12.857l102.286-102.286q5.428-5.428 12.857-5.428t12.857 5.428l175.429 175.428q5.428 5.429 5.428 12.857t-5.428 12.857l-29.143 29.143q-5.428 5.428-12.857 5.428t-12.857-5.428l-133.429-133.428-60.285 60.286q-5.428 5.428-12.857 5.428t-12.857-5.428l-29.143-29.143q-5.428-5.428-5.428-12.857z" />
<glyph unicode="&#xf1d8;" d="M0 181.714q-0.572 11.428 9.143 16.857l475.428 274.286q4.286 2.571 9.143 2.571 5.714 0 10.286-3.143 9.429-6.857 7.714-18.286l-73.143-438.857q-1.428-8.286-9.143-12.857-4-2.286-8.857-2.286-3.143 0-6.857 1.428l-129.429 52.857-69.143-84.286q-5.143-6.572-14-6.572-3.714 0-6.286 1.143-5.429 2-8.714 6.714t-3.286 10.428v99.714l246.857 302.572-305.428-264.286-112.857 46.286q-10.572 4-11.428 15.714z" />
</font></defs></svg>