<?xml version="1.0" standalone="no"?>
<!DOCTYPE svg PUBLIC "-//W3C//DTD SVG 1.1//EN" "http://www.w3.org/Graphics/SVG/1.1/DTD/svg11.dtd" >
<svg xmlns="http://www.w3.org/2000/svg">
<metadata>Generated by IcoMoon</metadata>
<defs>
<font id="icomoon" horiz-adv-x="512">
<font-face units-per-em="512" ascent="480" descent="-32" />
<missing-glyph horiz-adv-x="512" />
<glyph unicode="&#x20;" d="" horiz-adv-x="256" />
<glyph unicode="&#xe600;" d="M149.333 320v-42.666h128v42.666h-128zM149.333 234.667h192v21.333h-192v-21.333zM341.334 213.333h-64v-21.334h64v21.334zM277.334 149.333h64v21.334h-64v-21.334zM64 426.667v-213.334h42.666v170.667h277.334v-362.667h-106.666v-42.666h149.334v448h-362.666zM207.083 96c0 5.12-0.768 10.026-1.877 14.784l29.611 19.861-19.008 32.555-29.952-20.010c-5.525 4.864-11.882 8.576-18.858 10.986v37.824h-35.819v-37.995c-6.805-2.411-12.971-6.101-18.389-10.88l-29.867 20.075-18.986-32.555 29.61-19.84c-1.109-4.757-1.877-9.685-1.877-14.805 0-5.142 0.768-10.070 1.877-14.827l-29.547-19.819 19.008-32.555 29.782 20.075c5.397-4.779 11.584-8.448 18.389-10.88v-37.995h35.819v37.803c6.976 2.389 13.334 6.101 18.858 10.966l29.867-19.99 19.050 32.555-29.568 19.84c1.088 4.779 1.877 9.685 1.877 14.827zM149.376 57.579c-19.755 0-35.819 17.216-35.819 38.421s16.064 38.4 35.819 38.4c19.797 0 35.819-17.195 35.819-38.4s-16.022-38.421-35.819-38.421z" />
<glyph unicode="&#xe606;" d="M424 48h-48c-4.416 0-8 3.584-8 8s3.584 8 8 8h40v40c0 4.416 3.584 8 8 8 4.4 0 8-3.584 8-8v-48c0-4.416-3.6-8-8-8zM424 144c-4.416 0-8 3.584-8 8v48c0 4.416 3.584 8 8 8 4.4 0 8-3.584 8-8v-48c0-4.416-3.6-8-8-8zM424 240c-4.416 0-8 3.584-8 8v48c0 4.416 3.584 8 8 8 4.4 0 8-3.584 8-8v-48c0-4.416-3.6-8-8-8zM424 336c-4.416 0-8 3.584-8 8v40h-40c-4.416 0-8 3.584-8 8s3.584 8 8 8h48c4.4 0 8-3.584 8-8v-48c0-4.416-3.6-8-8-8zM234.656 143.152c-2.944-2.96-7.728-2.96-10.688 0l-16.032 16.032c-0.032 0.048-0.016 0.112-0.048 0.144l-51.008 51.392c-2.96 2.944-2.96 7.728 0 10.688l16.032 16.048c2.96 2.96 7.744 2.96 10.704 0l45.76-46.096 96.224 96.208c2.944 2.96 7.728 2.96 10.688 0l16.032-16.048c2.976-2.96 2.976-7.744 0-10.704l-117.664-117.664zM328 384h-48c-4.416 0-8 3.584-8 8s3.584 8 8 8h48c4.4 0 8-3.584 8-8s-3.6-8-8-8zM232 384h-48c-4.416 0-8 3.584-8 8s3.584 8 8 8h48c4.4 0 8-3.584 8-8s-3.6-8-8-8zM136 48h-48c-4.416 0-8 3.584-8 8v48c0 4.416 3.584 8 8 8s8-3.584 8-8v-40h40c4.416 0 8-3.584 8-8s-3.584-8-8-8zM136 384h-40v-40c0-4.416-3.584-8-8-8s-8 3.584-8 8v48c0 4.416 3.584 8 8 8h48c4.416 0 8-3.584 8-8s-3.584-8-8-8zM88 304c4.416 0 8-3.584 8-8v-48c0-4.416-3.584-8-8-8s-8 3.584-8 8v48c0 4.416 3.584 8 8 8zM88 208c4.416 0 8-3.584 8-8v-48c0-4.416-3.584-8-8-8s-8 3.584-8 8v48c0 4.416 3.584 8 8 8zM184 64h48c4.4 0 8-3.584 8-8s-3.6-8-8-8h-48c-4.416 0-8 3.584-8 8s3.584 8 8 8zM280 64h48c4.4 0 8-3.584 8-8s-3.6-8-8-8h-48c-4.416 0-8 3.584-8 8s3.584 8 8 8z" />
<glyph unicode="&#xe607;" d="M64 320v-64h-64v64h64zM0 416c0 35.328 28.672 64 64 64h32v-64c-17.696 0-32-14.304-32-32h-64v32zM160 416v64h64v-64h-64zM64 64c0-17.696 14.304-32 32-32v-64h-32c-35.328 0-64 28.672-64 64v32h64zM64 192v-64h-64v64h64zM160-32v64h64v-64h-64zM448 256v64h64v-64h-64zM288-32v64h64v-64h-64zM448 480c35.328 0 64-28.672 64-64v-32h-64c0 17.696-14.304 32-32 32v64h32zM448 128v64h64v-64h-64zM416 32c17.696 0 32 14.304 32 32h64v-32c0-35.328-28.672-64-64-64h-32v64zM288 416v64h64v-64h-64z" />
<glyph unicode="&#xf14a;" d="M0 82.286v274.286q0 34 24.143 58.143t58.143 24.143h274.286q34 0 58.143-24.143t24.143-58.143v-274.286q0-34-24.143-58.143t-58.143-24.143h-274.286q-34 0-58.143 24.143t-24.143 58.143zM62.285 219.429q0-7.428 5.428-12.857l102.286-102.286q5.428-5.428 12.857-5.428t12.857 5.428l175.429 175.428q5.428 5.429 5.428 12.857t-5.428 12.857l-29.143 29.143q-5.428 5.428-12.857 5.428t-12.857-5.428l-133.429-133.428-60.285 60.286q-5.428 5.428-12.857 5.428t-12.857-5.428l-29.143-29.143q-5.428-5.428-5.428-12.857z" />
</font></defs></svg>