{
	"packages": ["packages/*", "libs/*", "public/*", "resources/*"],
	"version": "0.1.14",
	"useWorkspaces": true,
	"npmClient": "yarn",
	"command": {
		"publish": {
			"conventionalCommits": true
		},
		"version": {
			"message": "chore(release): release",
			"allowBranch": ["release/*"]
		}
	},
	"changelog": {
		"ignoreCommitters": ["allcontributors"],
		"labels": {
			"enhancement": ":rocket: New Feature",
			"core": ":earth_asia: Core",
			"bug": ":bug: Bug Fix"
		}
	}
}
