\relax 
\providecommand\babel@aux[2]{}
\@nameuse{bbl@beforestart}
\catcode `:\active 
\catcode `;\active 
\catcode `!\active 
\catcode `?\active 
\babel@aux{french}{}
\@writefile{toc}{\contentsline {section}{\numberline {}Exercice 5}{1}{}\protected@file@percent }
\@writefile{toc}{\contentsline {subsection}{\numberline {}1}{1}{}\protected@file@percent }
\@writefile{toc}{\contentsline {subsection}{\numberline {}2}{1}{}\protected@file@percent }
\@writefile{toc}{\contentsline {section}{\numberline {}Exercice 6}{1}{}\protected@file@percent }
\@writefile{toc}{\contentsline {subsection}{\numberline {}1}{1}{}\protected@file@percent }
\@writefile{toc}{\contentsline {subsection}{\numberline {}2}{2}{}\protected@file@percent }
\@writefile{toc}{\contentsline {paragraph}{Initialisation}{2}{}\protected@file@percent }
\@writefile{toc}{\contentsline {paragraph}{Hérédité}{2}{}\protected@file@percent }
\@writefile{toc}{\contentsline {paragraph}{Conclusion}{2}{}\protected@file@percent }
\@writefile{toc}{\contentsline {paragraph}{Initialisation}{2}{}\protected@file@percent }
\@writefile{toc}{\contentsline {paragraph}{Hérédité}{2}{}\protected@file@percent }
\@writefile{toc}{\contentsline {paragraph}{Conclusion}{2}{}\protected@file@percent }
\@writefile{toc}{\contentsline {subsection}{\numberline {}3}{2}{}\protected@file@percent }
\gdef \@abspage@last{2}
