EESchema Schematic File Version 4
EELAYER 30 0
EELAYER END
$Descr A4 11693 8268
encoding utf-8
Sheet 1 1
Title ""
Date ""
Rev ""
Comp ""
Comment1 ""
Comment2 ""
Comment3 ""
Comment4 ""
$EndDescr
Wire Wire Line
	2850 2200 2850 950 
Wire Wire Line
	2850 950  1400 950 
Wire Wire Line
	1400 950  1400 1550
Wire Wire Line
	1400 1550 1550 1550
Wire Wire Line
	1550 1450 1450 1450
Wire Wire Line
	1450 1450 1450 1000
Wire Wire Line
	1450 1000 2750 1000
Wire Wire Line
	2750 1000 2750 1750
Wire Wire Line
	2750 1750 4250 1750
Wire Wire Line
	4250 1150 3250 1150
Wire Wire Line
	3250 1150 3250 850 
Wire Wire Line
	3250 850  2200 850 
Wire Wire Line
	2200 850  2200 1150
Wire Wire Line
	2950 1450 2950 2950
Wire Wire Line
	2950 2950 2300 2950
Wire Wire Line
	2300 2950 2300 2800
Wire Wire Line
	4250 1300 4150 1300
Wire Wire Line
	4150 1300 4150 800 
Wire Wire Line
	4150 800  1300 800 
Wire Wire Line
	1300 800  1300 1650
Wire Wire Line
	1300 1650 1550 1650
Wire Wire Line
	1550 2650 1450 2650
Wire Wire Line
	1450 2650 1450 3700
Wire Wire Line
	1450 3700 4800 3700
Wire Wire Line
	4800 3700 4800 3500
Wire Wire Line
	4900 3500 4900 3750
Wire Wire Line
	4900 3750 1400 3750
Wire Wire Line
	1400 3750 1400 2550
Wire Wire Line
	1400 2550 1550 2550
Wire Wire Line
	1550 2450 1350 2450
Wire Wire Line
	1350 2450 1350 3800
Wire Wire Line
	1350 3800 5000 3800
Wire Wire Line
	5000 3800 5000 3500
Wire Wire Line
	5100 3500 5100 3850
Wire Wire Line
	5100 3850 1300 3850
Wire Wire Line
	1300 3850 1300 2350
Wire Wire Line
	1300 2350 1550 2350
Wire Wire Line
	5200 3500 5200 3900
Wire Wire Line
	5200 3900 1250 3900
Wire Wire Line
	1250 3900 1250 2250
Wire Wire Line
	1250 2250 1550 2250
Wire Wire Line
	1550 2150 1200 2150
Wire Wire Line
	1200 2150 1200 3950
Wire Wire Line
	1200 3950 5300 3950
Wire Wire Line
	5300 3950 5300 3500
Wire Wire Line
	5400 3500 5400 4000
Wire Wire Line
	5400 4000 1150 4000
Wire Wire Line
	1150 4000 1150 2050
Wire Wire Line
	1150 2050 1550 2050
Wire Wire Line
	1550 1950 1100 1950
Wire Wire Line
	1100 1950 1100 4050
Wire Wire Line
	1100 4050 5500 4050
Wire Wire Line
	5500 4050 5500 3500
$Comp
L arduino_uno_r3:Arduino_Uno_R3 Uno_R3?
U 1 1 5E2726D8
P 2050 3050
F 0 "Uno_R3?" H 2050 4150 60  0001 C CNN
F 1 "Arduino_Uno_R3" H 2100 3119 60  0000 C CNN
F 2 "" H 2050 3050 60  0001 C CNN
F 3 "" H 2050 3050 60  0001 C CNN
	1    2050 3050
	1    0    0    -1  
$EndComp
Connection ~ 2200 1150
Connection ~ 1550 1450
Connection ~ 1550 1550
Connection ~ 1550 2450
Connection ~ 1550 2550
Connection ~ 1550 2650
Connection ~ 1550 1650
Connection ~ 1550 1950
Connection ~ 1550 2050
Connection ~ 1550 2150
Connection ~ 1550 2250
Connection ~ 1550 2350
Connection ~ 2300 2800
Wire Wire Line
	2850 2200 4250 2200
Wire Wire Line
	2950 1450 4250 1450
$Comp
L RC522:RC522 RC522?
U 1 1 5E275FB1
P 4650 1700
F 0 "RC522?" H 5400 1150 60  0001 C CNN
F 1 "RC522" H 6228 1725 60  0000 L CNN
F 2 "" H 4650 1700 60  0001 C CNN
F 3 "" H 4650 1700 60  0001 C CNN
	1    4650 1700
	1    0    0    -1  
$EndComp
$Comp
L Keypad:Keypad Keypad?
U 1 1 5E2769EA
P 5150 3350
F 0 "Keypad?" H 5150 2350 60  0001 C CNN
F 1 "Keypad" H 5628 3650 60  0000 L CNN
F 2 "" H 5100 3350 60  0001 C CNN
F 3 "" H 5100 3350 60  0001 C CNN
	1    5150 3350
	1    0    0    -1  
$EndComp
$EndSCHEMATC
