# ADSP - from FP3-REL-6.A.020.0-gms-88126537-user
vendor/bin/adsprpcd|5e246a6f5d2dca27e29b233a17e4673532191b95
vendor/etc/init/vendor.qti.adsprpc-guestos-service.rc|8f0eb84d3eb5fc0f683ef7b975b75044d56f513e
vendor/lib/libadsp_default_listener.so|4baca0fcd9a7e7eb6c3030d6ac2a8d6554c508ae
vendor/lib/libadsprpc.so|e0bc6ba5d66f918ffef39d2ba8cdd6055686ce43
vendor/lib/libfastcvadsp_stub.so|886e33a28a32f6a143081ab07deb186fd379408f
vendor/lib/libfastcvopt.so|c5bd1dd6c1fe02964f75f44ad05b472951a327f1
vendor/lib/libmdsprpc.so|36c4319420dbb531b4a66c786059bd3f5d4c4689
vendor/lib/libsdsprpc.so|4e4e26576b40cfd453c6d7adbfe57c3ec7747d9d
vendor/lib64/libadsp_default_listener.so|3ebcf635d6cdc447b8ecd40ea76bda39bf82c308
vendor/lib64/libadsprpc.so|53e5e6d473eaf60ad20df9aecdf6daeb07019027
vendor/lib64/libfastcvadsp_stub.so|a7dd1371e6f8f888d3a411cbbc6778c6a0271984
vendor/lib64/libfastcvopt.so|b68d2ce2a17193a5c91cadb1291fa9ea69ee80b2
vendor/lib64/libmdsprpc.so|f2cf241d1ea01ad13da6232717abceee138347a6
vendor/lib64/libsdsprpc.so|559416d50f6f57dd5bbf332d357a58469bb42721

# ADSP-Modules - from FP3-REL-6.A.020.0-gms-88126537-user
vendor/lib/rfsa/adsp/libadsp_fd_skel.so|677d2932dac248049f031fc5893163e22b49439a
vendor/lib/rfsa/adsp/libapps_mem_heap.so|5c82ad9cfe3f30105d899e2a4e90cc7566f81252
vendor/lib/rfsa/adsp/libdspCV_skel.so|628985174b0088bed21c866d7984d23855e5e150
vendor/lib/rfsa/adsp/libfastcvadsp.so|9818625bfa018f517e32a8f4a1e7fb4b255e5049
vendor/lib/rfsa/adsp/libfastcvadsp_skel.so|1ff4a48009e88435d93fd2b9b0c5ea59cedbb4f7

# ADSP-Modules (Dirac)
vendor/lib/rfsa/adsp/dirac_resource.dar|d9b3693eab8c520ef859236b8235752188b7cba0
vendor/lib/rfsa/adsp/libdirac-capiv2.so|e56031dfaee094d5267e3cc16625cfceaa07cc27

# ANT - from FP3-REL-6.A.020.0-gms-88126537-user
system_ext/lib64/com.qualcomm.qti.ant@1.0.so|2bad2579ce576c46af6a50ee6687bd92fa7f76cd
vendor/lib64/hw/com.dsi.ant@1.0-impl.so|6e2b594b44552b42000164c091af5cf7a4c508f5

# Audio - from FP3-REL-6.A.020.0-gms-88126537-user
vendor/lib/libacdb-fts.so|458980ecf3ba88c4e6d4862af727ac8b52a8c943
vendor/lib/libacdbloader.so|8e5758fbaa7a1c717d7ff15851972951697a0ee2
vendor/lib/libacdbrtac.so|2bfe2d2c49833b37dee10d2776d97bb368d5a1a5
vendor/lib/libadiertac.so|53b70da188c6aee0333a1f4d368f7ac8ffba3fae
vendor/lib/libadm.so|0c12ba8a37d5c01f49d58c36b9fb84354ae568a9
vendor/lib/libaudcal.so|ea9f62700c66d8dbaf4575e567fa67046ee66a49
vendor/lib/libaudioalsa.so|50d2e0a9599e3a6c44345956d672cc5f222e3653
vendor/lib/libdrc.so|7dbd6cef13d7e8ad18b1a49aa92a7d83da24c96a
vendor/lib/libqtigef.so|b38ae7f8880f5dd90b306e1c96283da1d11f8862
vendor/lib/libsurround_3mic_proc.so|98038406a407141f77fb7c81b512b8163261d958

# Audio-ACDB - from rosy:8.1.0/OPM1.171019.026/V11.0.2.0.ODAMIXM
vendor/etc/acdbdata/adsp_avs_config.acdb|ac0616af3b2d4f070c0e54c18126a877e528621b
vendor/etc/acdbdata/MTP/msm8953-tasha-snd-card/MTP_WCD9335_Bluetooth_cal.acdb|38c6e7d42ae194d238198e33fdb1c3f525e5a326
vendor/etc/acdbdata/MTP/msm8953-tasha-snd-card/MTP_WCD9335_General_cal.acdb|aa13ec31e85bae208ab5a9723dc1aa6dff041b6d
vendor/etc/acdbdata/MTP/msm8953-tasha-snd-card/MTP_WCD9335_Global_cal.acdb|c608e52607c2389eb3f52f2053c98438ebcdff10
vendor/etc/acdbdata/MTP/msm8953-tasha-snd-card/MTP_WCD9335_Handset_cal.acdb|2bb7c0bfac4308d4c112d8e3fee55d8e995a8176
vendor/etc/acdbdata/MTP/msm8953-tasha-snd-card/MTP_WCD9335_Hdmi_cal.acdb|be7fc11d6342ccd931e7901886ca01eaa207e539
vendor/etc/acdbdata/MTP/msm8953-tasha-snd-card/MTP_WCD9335_Headset_cal.acdb|9129d83bc6363a2a67d6a7a216cc2fd95c64a84d
vendor/etc/acdbdata/MTP/msm8953-tasha-snd-card/MTP_WCD9335_Speaker_cal.acdb|0507d4aded452d3c948f588240109c77b5f91372
vendor/etc/acdbdata/MTP/msm8953-tasha-snd-card/MTP_WCD9335_workspaceFile.qwsp|90182e8da8b719099bfc1db6b6d70623307f55ff
vendor/etc/acdbdata/MTP/MTP_Bluetooth_cal.acdb|69d97d52c5ff2a47ef13aeded96af7c5c78e3b13
vendor/etc/acdbdata/MTP/MTP_General_cal.acdb|6f6fe990add3c3d5e096a345dad151a134c437b8
vendor/etc/acdbdata/MTP/MTP_Global_cal.acdb|cd62dfc80137bee694529f3206f97d7f5c4b1978
vendor/etc/acdbdata/MTP/MTP_Handset_cal.acdb|dee549610c24d9e35012dc883278ab7a58ce99bb
vendor/etc/acdbdata/MTP/MTP_Hdmi_cal.acdb|a44c60fe0d65c73366e35c5c19d0195c77c458f0
vendor/etc/acdbdata/MTP/MTP_Headset_cal.acdb|42c1c655c3b0038208a626132dfb063ae57fef03
vendor/etc/acdbdata/MTP/MTP_Speaker_cal.acdb|ac0f6d164cec18c2fef3992a6c22aca2bcf16f08
vendor/etc/acdbdata/MTP/MTP_workspaceFile.qwsp|921ca227bc413a69c1ff0075f0a20c7f0ec86566

# Bluetooth - from FP3-REL-6.A.020.0-gms-88126537-user
vendor/bin/hw/android.hardware.bluetooth@1.0-service-qti|73d7132773572d87bdac6b5e454573e79d35316c
vendor/etc/init/android.hardware.bluetooth@1.0-service-qti.rc|f4ee3b2da2b08647447869ade86ec63f7340accc
vendor/lib64/hw/android.hardware.bluetooth@1.0-impl-qti.so|1e238b1e84d889f424001f5134f0d2994d13251a

# Bluetooth (audio) - from FP3-REL-6.A.020.0-gms-88126537-user
vendor/lib64/libbtnv.so|82cc941c6a262e0965925b4955b1ea508b798bfa
vendor/lib64/libbt-hidlclient.so|58caa4b8fac26ae5011c6439a1aff71f0a14a9a3
vendor/lib64/libsoc_helper.so|affbc1cc49d3df3a6e174a21bf3fe79c7130d1c0
vendor/lib64/vendor.qti.hardware.fm@1.0.so|a7c3fdcdfdf2d982b04baa89e0e4dc5f5d505bf7

# Bluetooth (Configstore) - from FP3-REL-6.A.020.0-gms-88126537-user
vendor/lib64/hw/vendor.qti.hardware.btconfigstore@2.0-impl.so|05e2d1fd44260cf603eb40a9f795d9ff4c43226f

# Bluetooth (SAR) - from FP3-REL-6.A.020.0-gms-88126537-user
vendor/lib64/hw/vendor.qti.hardware.bluetooth_sar@1.1-impl.so|68848631511ed0117adc540725d0e2fa57843bd9
vendor/lib64/vendor.qti.hardware.bluetooth_sar@1.0.so|25b2ce43c28c274b15c3b683831c214e3efb531d
vendor/lib64/vendor.qti.hardware.bluetooth_sar@1.1.so|117b74f1df4ee67297f431ae47d622bbb8f587ca

# CNE - from FP3-REL-6.A.020.0-gms-88126537-user
system_ext/framework/com.quicinc.cne.api-V1.1-java.jar|e71f1a060bc65eb373beb6d33158c0e2b37e2a70
system_ext/framework/com.quicinc.cne.constants-V1.0-java.jar|e0e0bb8ed025b0682483c395de6ec42b5b3c0058
system_ext/framework/com.quicinc.cne.constants-V2.0-java.jar|12730a1700afbe8afa6534d4e10ade07808b5398
system_ext/framework/com.quicinc.cne.constants-V2.1-java.jar|d10a6f1bcef5e9b0e2b0afab69203b4b67fb1217
system_ext/framework/vendor.qti.hardware.data.cne.internal.api-V1.0-java.jar|bcaa5cec38cd357f4618fc619317207e4430b307
system_ext/framework/vendor.qti.hardware.data.cne.internal.constants-V1.0-java.jar|e82ea6137b19e40028c78a70c7394eccdbef000b
system_ext/framework/vendor.qti.hardware.data.connection-V1.0-java.jar|c6e5d125ce87fa585eb666b82642c565501eb4c1
system_ext/framework/vendor.qti.hardware.data.connection-V1.1-java.jar|ebb1435d9dd340b5ff7d5f94644da6a29824ab15
system_ext/framework/vendor.qti.hardware.data.dynamicdds-V1.0-java.jar|da83f28bb82ca6cb016612ff126aba2123e3516a
system_ext/framework/vendor.qti.hardware.data.iwlan-V1.0-java.jar|b776f0042dbb7fb5f6619dbc5b97c42248b4e4f2
system_ext/framework/vendor.qti.hardware.data.qmi-V1.0-java.jar|ff9d6d52309ce32124af851eacd82de8de7d2e12
system_ext/lib64/com.quicinc.cne.api@1.0.so|76440d7953db0808e855eee393e116841b59c6d5
system_ext/lib64/com.quicinc.cne.api@1.1.so|0b7d8bca2364f1445f3ba1208fc68f7eac7578fe
system_ext/lib64/com.quicinc.cne.constants@1.0.so|e700fbf189a96fe1821a89d59d04c7d14ab14cf7
system_ext/lib64/com.quicinc.cne.constants@2.0.so|a5d80268d940651509d9bfc10f38538d6da04580
system_ext/lib64/com.quicinc.cne.constants@2.1.so|cf8a4412ca6ee339ac0dc2a14a9fad3091874c6f
system_ext/lib64/libmwqemiptablemgr.so|9431a5b3224c9de09fb839f3be8d5d1cade1c93d
system_ext/lib64/vendor.qti.hardware.data.cne.internal.api@1.0.so|496982703c92d6b43458c7e1324b212329693ffb
system_ext/lib64/vendor.qti.hardware.data.cne.internal.constants@1.0.so|3ac82400c2c7c5314277c585b72f08d33021aaee
system_ext/lib64/vendor.qti.hardware.data.cne.internal.server@1.0.so|a7462a29278bd1d40889a673aba5b7fa874c6725
system_ext/lib64/vendor.qti.hardware.data.connection@1.0.so|d61b0440ea99633a138d5a5390628eaaa4e4072b
system_ext/lib64/vendor.qti.hardware.data.connection@1.1.so|c113793477c938f4c1fcb90db684a4908c801668
system_ext/lib64/vendor.qti.hardware.data.dynamicdds@1.0.so|7cafa97c3f4fd1b2e52606721f901c044bcfa85e
system_ext/lib64/vendor.qti.hardware.data.iwlan@1.0.so|8f6ee7e2269f68ff7e7d77518740e424f136c172
system_ext/lib64/vendor.qti.hardware.data.qmi@1.0.so|dbede1bf4e67724b1215beda05dbc3531df3b93e
-vendor/app/CACertService/CACertService.apk|40abe899d717c5f189beeb0a58abd9d4127bfa57
-vendor/app/CneApp/CneApp.apk|fa57f899f8cdd8d8ad441b06e0f494ff5237519c
-vendor/app/IWlanService/IWlanService.apk|cc19c2f66063f7c8807a03a8c20de85abe263cb6
vendor/bin/cnd|78d2771551abf43a093a0fbe0aba933c9f6a8097
vendor/etc/cne/mwqem.conf|c51d3893b86ab89fae218f3a92c4f9c18ea401a8
vendor/etc/cne/profileMwqem.xml|947917691684584b7e2ddf3588cd6f8e99f3804f
vendor/etc/cne/wqeclient/ATT/ATT_profile1.xml|578f3f8f56059bfdbef926bcc68d01c15e06951f
vendor/etc/cne/wqeclient/ATT/ATT_profile2.xml|1fb42c672a12b6660bdce3ea94e0c43719dd9de8
vendor/etc/cne/wqeclient/ATT/ATT_profile3.xml|f88e13f1dd7b82388c90358f71813026370c9ed8
vendor/etc/cne/wqeclient/ATT/ATT_profile4.xml|fb08e04f57797c5684bf734f7ce4bb4968859b18
vendor/etc/cne/wqeclient/ATT/ATT_profile5.xml|eb726ad1a42b9b78b9ee3b821fc108611bc9eeac
vendor/etc/cne/wqeclient/ATT/ATT_profile6.xml|be97b46b0d07ee2f6ebcc677d8099ed2140d5d85
vendor/etc/cne/wqeclient/ROW/ROW_profile1.xml|e7ca213d0998cb3a6a603ad3eca7bda69830ff55
vendor/etc/cne/wqeclient/ROW/ROW_profile15.xml|0130dfd8326ee710bf4e15718ede87c49a85b763
vendor/etc/cne/wqeclient/ROW/ROW_profile16.xml|e05b935d7ccf48d306b71c719b2e4df83187d9c0
vendor/etc/cne/wqeclient/ROW/ROW_profile17.xml|f1b33204799268eda78dd8314f26abf2e37431e2
vendor/etc/cne/wqeclient/ROW/ROW_profile18.xml|19db16f62dabb806a62f192858a9d52b5bc2a064
vendor/etc/cne/wqeclient/ROW/ROW_profile19.xml|1fcc57b1fa4dbbc7d250e8dd92acf1527d447eb3
vendor/etc/cne/wqeclient/ROW/ROW_profile2.xml|169a5209000e357a1a3183e8e5bfdf6fd07c2787
vendor/etc/cne/wqeclient/ROW/ROW_profile20.xml|7be0614cf0116c39b736c58fe5eca36838aeb3db
vendor/etc/cne/wqeclient/ROW/ROW_profile21.xml|cc62517e6c37e12ee1ebebbb27f9c22878749be3
vendor/etc/cne/wqeclient/ROW/ROW_profile3.xml|4be4060e8ac2d9fcea490feec7938cadcff46e1f
vendor/etc/cne/wqeclient/ROW/ROW_profile32.xml|b87542b9284efe4c2bd0ae868bb9a765c2c3dbc5
vendor/etc/cne/wqeclient/ROW/ROW_profile4.xml|f88e13f1dd7b82388c90358f71813026370c9ed8
vendor/etc/cne/wqeclient/ROW/ROW_profile5.xml|96101f6b01436a02572c67a469ff67ccfb738874
vendor/etc/cne/wqeclient/ROW/ROW_profile6.xml|cef14ff8a160c7ad719b85d024a4b3301c3638d0
vendor/etc/cne/wqeclient/ROW/ROW_profile7.xml|8d6773a4c418d0dcc4dc9096017d2681c7a1defe
vendor/etc/cne/wqeclient/VZW/VZW_profile1.xml|c89d3c062790b442cbe941cafc641a4e322f2d59
vendor/etc/cne/wqeclient/VZW/VZW_profile2.xml|ba14a9df975cf872ed0cbe28bee8fac63cd848d4
vendor/etc/cne/wqeclient/VZW/VZW_profile3.xml|9b123d81c9b8991499cda33b0706810e0c8fb974
vendor/etc/cne/wqeclient/VZW/VZW_profile4.xml|ff91feb5060a6df07e3e4d9bc99ae58bccad7649
vendor/etc/cne/wqeclient/VZW/VZW_profile5.xml|f76c894f3c6d5b6ed35113a088dc3174c900501b
vendor/etc/cne/wqeclient/VZW/VZW_profile6.xml|14d136e7fcc682311757d3edc0b9d3eaeba11815
vendor/etc/default-permissions/com.qualcomm.qti.cne.xml|eb11e72a91439180816e9a1d912cbe42f9019f68
vendor/etc/init/cnd.rc|3a5183df3479500fb729493bc56c71166fc10bce
vendor/lib64/libcacertclient.so|69ae73b9be13507ff39398ac5813ad709b8b7c32
vendor/lib64/libcne.so|f7565b0b97975e7021bd007b8387ccc839a8dad9
vendor/lib64/libcneapiclient.so|b6479678e5b0e8b46d8df5eb8bd610aa17be00d0
vendor/lib64/libcneoplookup.so|3ce1039ad657d889f90140cb630eb487d2e711df
vendor/lib64/libcneqmiutils.so|582c925ce11d12bd2dd15a5927623835bce06a01
vendor/lib64/libjnihelper.so|d3687f06782adc074a38b9ff3c1aacd57ec7a6e7
vendor/lib64/libwms.so|1b91f43e9e9a8f143cddd1d945c63d384c65541c
vendor/lib64/libwqe.so|5561170b3ee4d9233a0e4f384be08e2e1d01f0f5
vendor/lib64/libxml.so|f9b20632e9fd324810caf865faea93e4ff505d91
vendor/lib64/vendor.qti.data.factory@2.0.so|748bfbaa57a409b8962e2b1725e1415e423a7315
vendor/lib64/vendor.qti.data.factory@2.1.so|bb1f3fa22563282ee24bf03ca681fdc45551feef
vendor/lib64/vendor.qti.data.factory@2.2.so|6951ff98d20902678e8af584c7b4cf89e360f31b
vendor/lib64/vendor.qti.data.factory@2.3.so|e9992039c400ef5fb57db62e108873a219348b4c
vendor/lib64/vendor.qti.data.mwqem@1.0.so|81c450f4fb69f283a0f5b31977264ffacc3dc885
vendor/lib64/vendor.qti.data.slm@1.0.so|fd136f7a6ff49db9748b5e245a67f33aa3f21858
vendor/lib64/vendor.qti.hardware.cacert@1.0.so|1633c31212d1ea9338b79ebfc2476f83424f36ee
vendor/lib64/vendor.qti.hardware.data.cne.internal.api@1.0.so|e4d002e61b2d6a4d3826e0563ee16cac74696833
vendor/lib64/vendor.qti.hardware.data.cne.internal.constants@1.0.so|f87a303f7a092c4d18b7db91d5162a777c920817
vendor/lib64/vendor.qti.hardware.data.cne.internal.server@1.0.so|7d80cd3bda9fd34dd1629116124579e5a4a787f5
vendor/lib64/vendor.qti.hardware.data.connection@1.0.so|b1680808bd26a89a586f9aca8839ca9389b6503a
vendor/lib64/vendor.qti.hardware.data.connection@1.1.so|b71ecdd47c46cae07fca43057695996e134e414b
vendor/lib64/vendor.qti.hardware.data.dynamicdds@1.0.so|cd51703f1ff29c57e545df41592be32c43ed00c0
vendor/lib64/vendor.qti.hardware.data.iwlan@1.0.so|463659c4b5050c1af1d100c83914fd710ca99710
vendor/lib64/vendor.qti.hardware.data.latency@1.0.so|72345083feb96e9ecd86d49725d4815b075c9646
vendor/lib64/vendor.qti.hardware.data.qmi@1.0.so|851db5940d5e9e4330e16221be114aef14f52325
vendor/lib64/vendor.qti.hardware.mwqemadapter@1.0.so|c041dbfc99643e791e52c4e7f3a87050a8cd6c93
vendor/lib64/vendor.qti.hardware.slmadapter@1.0.so|000e0d2ac4450c0ad8baca06985bc9065e119f1e
vendor/lib64/vendor.qti.latency@2.0.so|82196d2863e012ad2b6e1b9af9d9ce7c611f64be
vendor/lib64/vendor.qti.latency@2.1.so|d279c5e456bb3e546130df3cd6f398cea6b48eaf

# Camera
vendor/bin/mm-qcamera-daemon|7f89435fcd382bf4013aab7df41aebf4ea697cc9
vendor/lib/libllvd_smore.so
vendor/lib/libChamomilePA.so
vendor/lib64/libChamomilePA.so
vendor/lib/libscvePanorama.so
vendor/lib64/libscvePanorama.so
vendor/lib/libscvePanorama_lite.so
vendor/lib64/libscvePanorama_lite.so
vendor/lib/libmorpho_easy_hdr.so
vendor/lib/libmorpho_hdr_checker.so
vendor/lib/libmorpho_panorama_gp.so
vendor/lib64/libmorpho_panorama_gp.so
vendor/lib/libmpbase.so|f6f0a3ad248aa3caf17b5f90fa26fe529476cf7f
vendor/lib/libchromaflash.so
vendor/lib/libflash_gpio.so
vendor/lib/libflash_pmic.so
vendor/lib/libjpegdhw.so
vendor/lib/libjpegdmahw.so
vendor/lib/libjpegehw.so
vendor/lib/libmmjpeg.so
vendor/lib/libmmqjpeg_codec.so
vendor/lib/libmmqjpegdma.so
vendor/lib/libmmsw_detail_enhancement.so|86d9f44c0b3c7d6f7a945beae73f7e07a0f70ff0
vendor/lib/libmmsw_math.so
vendor/lib/libmmsw_opencl.so
vendor/lib/libmmsw_platform.so|337d5b4b4cee8bdcca406853a1b2396452bf53d5
vendor/lib/libois_lc898122.so
vendor/lib/liboptizoom.so
vendor/lib/libqomx_jpegdec.so
vendor/lib/libqomx_jpegenc_pipe.so
vendor/lib/libqomx_jpegenc.so
vendor/lib/libseemore.so
-vendor/lib/libts_detected_face_hal.so
-vendor/lib/libts_face_beautify_hal.so
vendor/lib/libtrueportrait.so
vendor/lib/libubifocus.so
vendor/lib/libremosaic_daemon.so

# Camera - from Hydrogen 7.0/NRD90M/V10.3.2.0.NBCCNXM
vendor/lib/libllvd_sw_tnr.so|406895e2ae614ac84a62d1758bce1810b99c5cda
vendor/lib/libmmcamera_sw_tnr.so|59b0f350eb0cfa85399c296af14ac680ca99705e

# Camera actuators from MIUI Stable - V9.2.3.0.NDAMIEK
vendor/lib/libactuator_ad5816g.so
vendor/lib/libactuator_ad5823.so
vendor/lib/libactuator_ak7345.so
vendor/lib/libactuator_ak7371.so
vendor/lib/libactuator_bu64244gwz.so
vendor/lib/libactuator_bu64297.so
vendor/lib/libactuator_dw9714.so
vendor/lib/libactuator_dw9716.so
vendor/lib/libactuator_dw9761b.so
vendor/lib/libactuator_dw9763.so
vendor/lib/libactuator_dw9763_ov13855.so
vendor/lib/libactuator_dw9763_sony_imx486_ii.so
vendor/lib/libactuator_fp5510e2_ov13855.so
vendor/lib/libactuator_lc898122.so
vendor/lib/libactuator_lc898212xd.so
vendor/lib/libactuator_lc898212xd_qc2002.so
vendor/lib/libactuator_lc898217xc.so
vendor/lib/libactuator_ovt_ov12a10_i_dw9763.so
vendor/lib/libactuator_pseudo.so
vendor/lib/libactuator_rohm_bu64243gwz.so

# Camera XML Configs from MIUI Stable - V9.2.3.0.NDAMIEK
vendor/etc/camera/camera_config.xml
vendor/etc/camera/csidtg_camera.xml
vendor/etc/camera/csidtg_chromatix.xml
vendor/etc/camera/ov13850_chromatix.xml
vendor/etc/camera/ov13850_q13v06k_chromatix.xml
vendor/etc/camera/ov13855_qtech_chromatix.xml
vendor/etc/camera/ov13855_qtech_india_chromatix.xml
vendor/etc/camera/ov13855_sunny_chromatix.xml
vendor/etc/camera/ov2281_chromatix.xml
vendor/etc/camera/ov2680_chromatix.xml
vendor/etc/camera/ov4688_chromatix.xml
vendor/etc/camera/ov5670_chromatix.xml
vendor/etc/camera/ov5670_f5670bq_chromatix.xml
vendor/etc/camera/ov5675_d5v15b_chromatix.xml
vendor/etc/camera/ov5675_ofilm_chromatix.xml
vendor/etc/camera/v5695_chromatix.xml
vendor/etc/camera/ov7251_chromatix.xml
vendor/etc/camera/ov8858_chromatix.xml
vendor/etc/camera/ov8865_chromatix.xml
vendor/etc/camera/ovt_ov12a10_i_chromatix.xml
vendor/etc/camera/ovt_ov5675_i_chromatix.xml
vendor/etc/camera/ovt_ov5675_ii_chromatix.xml
vendor/etc/camera/rosy_camera_india.xml
vendor/etc/camera/rosy_imx486_sunny_india_chromatix.xml
vendor/etc/camera/rosy_ov12a10_ofilm_india_chromatix.xml
vendor/etc/camera/rosy_ov5675_ofilm_india_chromatix.xml
vendor/etc/camera/rosy_ov5675_qtech_india_chromatix.xml
vendor/etc/camera/sony_imx486_ii_chromatix.xml
vendor/etc/camera/ov5695_chromatix.xml

# Camera chromatix from MIUI Stable - V9.2.3.0.NDAMIEK
vendor/lib/libchromatix_csidtg_common.so
vendor/lib/libchromatix_csidtg_cpp_preview.so
vendor/lib/libchromatix_csidtg_postproc.so
vendor/lib/libchromatix_csidtg_preview.so
vendor/lib/libchromatix_csidtg_zsl_preview.so
vendor/lib/libchromatix_ov13850_common.so
vendor/lib/libchromatix_ov13850_cpp_ds_chromatix.so
vendor/lib/libchromatix_ov13850_cpp_hfr_120.so
vendor/lib/libchromatix_ov13850_cpp_hfr_60.so
vendor/lib/libchromatix_ov13850_cpp_hfr_90.so
vendor/lib/libchromatix_ov13850_cpp_liveshot.so
vendor/lib/libchromatix_ov13850_cpp_preview.so
vendor/lib/libchromatix_ov13850_cpp_snapshot.so
vendor/lib/libchromatix_ov13850_cpp_us_chromatix.so
vendor/lib/libchromatix_ov13850_cpp_video.so
vendor/lib/libchromatix_ov13850_cpp_video_full.so
vendor/lib/libchromatix_ov13850_default_preview_lc898212xd.so
vendor/lib/libchromatix_ov13850_default_video.so
vendor/lib/libchromatix_ov13850_default_video_lc898212xd.so
vendor/lib/libchromatix_ov13850_hfr_120.so
vendor/lib/libchromatix_ov13850_hfr_120_lc898212xd.so
vendor/lib/libchromatix_ov13850_hfr_60.so
vendor/lib/libchromatix_ov13850_hfr_60_lc898212xd.so
vendor/lib/libchromatix_ov13850_hfr_90.so
vendor/lib/libchromatix_ov13850_hfr_90_lc898212xd.so
vendor/lib/libchromatix_ov13850_postproc.so
vendor/lib/libchromatix_ov13850_preview.so
vendor/lib/libchromatix_ov13850_q13v06k_common.so
vendor/lib/libchromatix_ov13850_q13v06k_cpp_ds_chromatix.so
vendor/lib/libchromatix_ov13850_q13v06k_cpp_hfr_120.so
vendor/lib/libchromatix_ov13850_q13v06k_cpp_hfr_60.so
vendor/lib/libchromatix_ov13850_q13v06k_cpp_hfr_90.so
vendor/lib/libchromatix_ov13850_q13v06k_cpp_liveshot.so
vendor/lib/libchromatix_ov13850_q13v06k_cpp_preview.so
vendor/lib/libchromatix_ov13850_q13v06k_cpp_snapshot.so
vendor/lib/libchromatix_ov13850_q13v06k_cpp_us_chromatix.so
vendor/lib/libchromatix_ov13850_q13v06k_cpp_video.so
vendor/lib/libchromatix_ov13850_q13v06k_cpp_video_full.so
vendor/lib/libchromatix_ov13850_q13v06k_default_preview_bu64297.so
vendor/lib/libchromatix_ov13850_q13v06k_default_video.so
vendor/lib/libchromatix_ov13850_q13v06k_default_video_bu64297.so
vendor/lib/libchromatix_ov13850_q13v06k_hfr_120.so
vendor/lib/libchromatix_ov13850_q13v06k_hfr_120_bu64297.so
vendor/lib/libchromatix_ov13850_q13v06k_hfr_60.so
vendor/lib/libchromatix_ov13850_q13v06k_hfr_60_bu64297.so
vendor/lib/libchromatix_ov13850_q13v06k_hfr_90.so
vendor/lib/libchromatix_ov13850_q13v06k_hfr_90_bu64297.so
vendor/lib/libchromatix_ov13850_q13v06k_liveshot.so
vendor/lib/libchromatix_ov13850_q13v06k_postproc.so
vendor/lib/libchromatix_ov13850_q13v06k_preview.so
vendor/lib/libchromatix_ov13850_q13v06k_snapshot.so
vendor/lib/libchromatix_ov13850_q13v06k_video_full.so
vendor/lib/libchromatix_ov13850_q13v06k_zsl_preview_bu64297.so
vendor/lib/libchromatix_ov13850_q13v06k_zsl_video_bu64297.so
vendor/lib/libchromatix_ov13850_snapshot.so
vendor/lib/libchromatix_ov13850_video_full.so
vendor/lib/libchromatix_ov13850_zsl_preview_lc898212xd.so
vendor/lib/libchromatix_ov13850_zsl_video_lc898212xd.so
vendor/lib/libchromatix_ov13855_qtech_common.so
vendor/lib/libchromatix_ov13855_qtech_cpp_hfr_120.so
vendor/lib/libchromatix_ov13855_qtech_cpp_hfr_60.so
vendor/lib/libchromatix_ov13855_qtech_cpp_hfr_90.so
vendor/lib/libchromatix_ov13855_qtech_cpp_liveshot.so
vendor/lib/libchromatix_ov13855_qtech_cpp_preview.so
vendor/lib/libchromatix_ov13855_qtech_cpp_snapshot.so
vendor/lib/libchromatix_ov13855_qtech_cpp_video.so
vendor/lib/libchromatix_ov13855_qtech_default_preview_dw9763.so
vendor/lib/libchromatix_ov13855_qtech_default_video_dw9763.so
vendor/lib/libchromatix_ov13855_qtech_hfr_120.so
vendor/lib/libchromatix_ov13855_qtech_hfr_120_dw9763.so
vendor/lib/libchromatix_ov13855_qtech_hfr_60.so
vendor/lib/libchromatix_ov13855_qtech_hfr_60_dw9763.so
vendor/lib/libchromatix_ov13855_qtech_hfr_90.so
vendor/lib/libchromatix_ov13855_qtech_hfr_90_dw9763.so
vendor/lib/libchromatix_ov13855_qtech_india_common.so
vendor/lib/libchromatix_ov13855_qtech_india_cpp_hfr_120.so
vendor/lib/libchromatix_ov13855_qtech_india_cpp_hfr_60.so
vendor/lib/libchromatix_ov13855_qtech_india_cpp_hfr_90.so
vendor/lib/libchromatix_ov13855_qtech_india_cpp_liveshot.so
vendor/lib/libchromatix_ov13855_qtech_india_cpp_preview.so
vendor/lib/libchromatix_ov13855_qtech_india_cpp_snapshot.so
vendor/lib/libchromatix_ov13855_qtech_india_cpp_video.so
vendor/lib/libchromatix_ov13855_qtech_india_default_preview_dw9763.so
vendor/lib/libchromatix_ov13855_qtech_india_default_video_dw9763.so
vendor/lib/libchromatix_ov13855_qtech_india_hfr_120.so
vendor/lib/libchromatix_ov13855_qtech_india_hfr_120_dw9763.so
vendor/lib/libchromatix_ov13855_qtech_india_hfr_60.so
vendor/lib/libchromatix_ov13855_qtech_india_hfr_60_dw9763.so
vendor/lib/libchromatix_ov13855_qtech_india_hfr_90.so
vendor/lib/libchromatix_ov13855_qtech_india_hfr_90_dw9763.so
vendor/lib/libchromatix_ov13855_qtech_india_liveshot.so
vendor/lib/libchromatix_ov13855_qtech_india_postproc.so
vendor/lib/libchromatix_ov13855_qtech_india_preview.so
vendor/lib/libchromatix_ov13855_qtech_india_snapshot.so
vendor/lib/libchromatix_ov13855_qtech_india_video.so
vendor/lib/libchromatix_ov13855_qtech_india_zsl_preview_dw9763.so
vendor/lib/libchromatix_ov13855_qtech_india_zsl_video_dw9763.so
vendor/lib/libchromatix_ov13855_qtech_liveshot.so
vendor/lib/libchromatix_ov13855_qtech_postproc.so
vendor/lib/libchromatix_ov13855_qtech_preview.so
vendor/lib/libchromatix_ov13855_qtech_snapshot.so
vendor/lib/libchromatix_ov13855_qtech_video.so
vendor/lib/libchromatix_ov13855_qtech_zsl_preview_dw9763.so
vendor/lib/libchromatix_ov13855_qtech_zsl_video_dw9763.so
vendor/lib/libchromatix_ov13855_sunny_common.so
vendor/lib/libchromatix_ov13855_sunny_cpp_hfr_120.so
vendor/lib/libchromatix_ov13855_sunny_cpp_hfr_60.so
vendor/lib/libchromatix_ov13855_sunny_cpp_hfr_90.so
vendor/lib/libchromatix_ov13855_sunny_cpp_liveshot.so
vendor/lib/libchromatix_ov13855_sunny_cpp_preview.so
vendor/lib/libchromatix_ov13855_sunny_cpp_snapshot.so
vendor/lib/libchromatix_ov13855_sunny_cpp_video.so
vendor/lib/libchromatix_ov13855_sunny_default_preview_dw9763.so
vendor/lib/libchromatix_ov13855_sunny_default_video_dw9763.so
vendor/lib/libchromatix_ov13855_sunny_hfr_120.so
vendor/lib/libchromatix_ov13855_sunny_hfr_120_dw9763.so
vendor/lib/libchromatix_ov13855_sunny_hfr_60.so
vendor/lib/libchromatix_ov13855_sunny_hfr_60_dw9763.so
vendor/lib/libchromatix_ov13855_sunny_hfr_90.so
vendor/lib/libchromatix_ov13855_sunny_hfr_90_dw9763.so
vendor/lib/libchromatix_ov13855_sunny_liveshot.so
vendor/lib/libchromatix_ov13855_sunny_postproc.so
vendor/lib/libchromatix_ov13855_sunny_preview.so
vendor/lib/libchromatix_ov13855_sunny_snapshot.so
vendor/lib/libchromatix_ov13855_sunny_video.so
vendor/lib/libchromatix_ov13855_sunny_zsl_preview_dw9763.so
vendor/lib/libchromatix_ov13855_sunny_zsl_video_dw9763.so
vendor/lib/libchromatix_ov2281_a3_default_preview.so
vendor/lib/libchromatix_ov2281_a3_default_video.so
vendor/lib/libchromatix_ov2281_common.so
vendor/lib/libchromatix_ov2281_cpp_ds_chromatix.so
vendor/lib/libchromatix_ov2281_cpp_liveshot.so
vendor/lib/libchromatix_ov2281_cpp_preview.so
vendor/lib/libchromatix_ov2281_cpp_snapshot.so
vendor/lib/libchromatix_ov2281_cpp_us_chromatix.so
vendor/lib/libchromatix_ov2281_cpp_video.so
vendor/lib/libchromatix_ov2281_default_video.so
vendor/lib/libchromatix_ov2281_postproc.so
vendor/lib/libchromatix_ov2281_preview.so
vendor/lib/libchromatix_ov2281_snapshot.so
vendor/lib/libchromatix_ov2281_zsl_preview.so
vendor/lib/libchromatix_ov2281_zsl_video.so
vendor/lib/libchromatix_ov2680_a3_default_preview.so
vendor/lib/libchromatix_ov2680_a3_default_video.so
vendor/lib/libchromatix_ov2680_a3_hfr_60.so
vendor/lib/libchromatix_ov2680_common.so
vendor/lib/libchromatix_ov2680_cpp_hfr_60.so
vendor/lib/libchromatix_ov2680_cpp_liveshot.so
vendor/lib/libchromatix_ov2680_cpp_preview.so
vendor/lib/libchromatix_ov2680_cpp_snapshot.so
vendor/lib/libchromatix_ov2680_cpp_video.so
vendor/lib/libchromatix_ov2680_default_video.so
vendor/lib/libchromatix_ov2680_hfr_60.so
vendor/lib/libchromatix_ov2680_liveshot.so
vendor/lib/libchromatix_ov2680_postproc.so
vendor/lib/libchromatix_ov2680_preview.so
vendor/lib/libchromatix_ov2680_snapshot.so
vendor/lib/libchromatix_ov2680_zsl_preview.so
vendor/lib/libchromatix_ov4688_common.so
vendor/lib/libchromatix_ov4688_cpp_hfr_120.so
vendor/lib/libchromatix_ov4688_cpp_hfr_60.so
vendor/lib/libchromatix_ov4688_cpp_hfr_90.so
vendor/lib/libchromatix_ov4688_cpp_liveshot.so
vendor/lib/libchromatix_ov4688_cpp_preview.so
vendor/lib/libchromatix_ov4688_cpp_snapshot.so
vendor/lib/libchromatix_ov4688_cpp_video.so
vendor/lib/libchromatix_ov4688_default_video.so
vendor/lib/libchromatix_ov4688_hfr_120.so
vendor/lib/libchromatix_ov4688_hfr_120_ad5823.so
vendor/lib/libchromatix_ov4688_hfr_60.so
vendor/lib/libchromatix_ov4688_hfr_60_ad5823.so
vendor/lib/libchromatix_ov4688_hfr_90.so
vendor/lib/libchromatix_ov4688_hfr_90_ad5823.so
vendor/lib/libchromatix_ov4688_postproc.so
vendor/lib/libchromatix_ov4688_preview.so
vendor/lib/libchromatix_ov4688_snapshot.so
vendor/lib/libchromatix_ov4688_zsl_preview_ad5823.so
vendor/lib/libchromatix_ov4688_zsl_video_ad5823.so
vendor/lib/libchromatix_ov5670_a3_default_preview.so
vendor/lib/libchromatix_ov5670_a3_default_video.so
vendor/lib/libchromatix_ov5670_a3_hfr_120.so
vendor/lib/libchromatix_ov5670_a3_hfr_60.so
vendor/lib/libchromatix_ov5670_a3_hfr_90.so
vendor/lib/libchromatix_ov5670_common.so
vendor/lib/libchromatix_ov5670_cpp_ds_chromatix.so
vendor/lib/libchromatix_ov5670_cpp_hfr_120.so
vendor/lib/libchromatix_ov5670_cpp_hfr_60.so
vendor/lib/libchromatix_ov5670_cpp_hfr_90.so
vendor/lib/libchromatix_ov5670_cpp_liveshot.so
vendor/lib/libchromatix_ov5670_cpp_preview.so
vendor/lib/libchromatix_ov5670_cpp_snapshot.so
vendor/lib/libchromatix_ov5670_cpp_us_chromatix.so
vendor/lib/libchromatix_ov5670_cpp_video.so
vendor/lib/libchromatix_ov5670_cpp_video_full.so
vendor/lib/libchromatix_ov5670_default_video.so
vendor/lib/libchromatix_ov5670_f5670bq_a3_default_preview.so
vendor/lib/libchromatix_ov5670_f5670bq_a3_default_video.so
vendor/lib/libchromatix_ov5670_f5670bq_a3_hfr_120.so
vendor/lib/libchromatix_ov5670_f5670bq_a3_hfr_60.so
vendor/lib/libchromatix_ov5670_f5670bq_a3_hfr_90.so
vendor/lib/libchromatix_ov5670_f5670bq_common.so
vendor/lib/libchromatix_ov5670_f5670bq_cpp_ds_chromatix.so
vendor/lib/libchromatix_ov5670_f5670bq_cpp_hfr_120.so
vendor/lib/libchromatix_ov5670_f5670bq_cpp_hfr_60.so
vendor/lib/libchromatix_ov5670_f5670bq_cpp_hfr_90.so
vendor/lib/libchromatix_ov5670_f5670bq_cpp_liveshot.so
vendor/lib/libchromatix_ov5670_f5670bq_cpp_preview.so
vendor/lib/libchromatix_ov5670_f5670bq_cpp_snapshot.so
vendor/lib/libchromatix_ov5670_f5670bq_cpp_us_chromatix.so
vendor/lib/libchromatix_ov5670_f5670bq_cpp_video.so
vendor/lib/libchromatix_ov5670_f5670bq_cpp_video_full.so
vendor/lib/libchromatix_ov5670_f5670bq_default_video.so
vendor/lib/libchromatix_ov5670_f5670bq_hfr_120.so
vendor/lib/libchromatix_ov5670_f5670bq_hfr_60.so
vendor/lib/libchromatix_ov5670_f5670bq_hfr_90.so
vendor/lib/libchromatix_ov5670_f5670bq_liveshot.so
vendor/lib/libchromatix_ov5670_f5670bq_postproc.so
vendor/lib/libchromatix_ov5670_f5670bq_preview.so
vendor/lib/libchromatix_ov5670_f5670bq_snapshot.so
vendor/lib/libchromatix_ov5670_f5670bq_video_full.so
vendor/lib/libchromatix_ov5670_f5670bq_zsl_preview.so
vendor/lib/libchromatix_ov5670_f5670bq_zsl_video.so
vendor/lib/libchromatix_ov5670_hfr_120.so
vendor/lib/libchromatix_ov5670_hfr_60.so
vendor/lib/libchromatix_ov5670_hfr_90.so
vendor/lib/libchromatix_ov5670_postproc.so
vendor/lib/libchromatix_ov5670_preview.so
vendor/lib/libchromatix_ov5670_snapshot.so
vendor/lib/libchromatix_ov5670_video_full.so
vendor/lib/libchromatix_ov5670_zsl_preview.so
vendor/lib/libchromatix_ov5670_zsl_video.so
vendor/lib/libchromatix_ov5675_d5v15b_common.so
vendor/lib/libchromatix_ov5675_d5v15b_cpp_hfr_120.so
vendor/lib/libchromatix_ov5675_d5v15b_cpp_hfr_60.so
vendor/lib/libchromatix_ov5675_d5v15b_cpp_hfr_90.so
vendor/lib/libchromatix_ov5675_d5v15b_cpp_liveshot.so
vendor/lib/libchromatix_ov5675_d5v15b_cpp_preview.so
vendor/lib/libchromatix_ov5675_d5v15b_cpp_snapshot.so
vendor/lib/libchromatix_ov5675_d5v15b_cpp_video.so
vendor/lib/libchromatix_ov5675_d5v15b_default_preview_3a.so
vendor/lib/libchromatix_ov5675_d5v15b_default_video.so
vendor/lib/libchromatix_ov5675_d5v15b_default_video_3a.so
vendor/lib/libchromatix_ov5675_d5v15b_hfr_120.so
vendor/lib/libchromatix_ov5675_d5v15b_hfr_120_3a.so
vendor/lib/libchromatix_ov5675_d5v15b_hfr_60.so
vendor/lib/libchromatix_ov5675_d5v15b_hfr_60_3a.so
vendor/lib/libchromatix_ov5675_d5v15b_hfr_90.so
vendor/lib/libchromatix_ov5675_d5v15b_hfr_90_3a.so
vendor/lib/libchromatix_ov5675_d5v15b_liveshot.so
vendor/lib/libchromatix_ov5675_d5v15b_postproc.so
vendor/lib/libchromatix_ov5675_d5v15b_preview.so
vendor/lib/libchromatix_ov5675_d5v15b_snapshot.so
vendor/lib/libchromatix_ov5675_d5v15b_zsl_preview_3a.so
vendor/lib/libchromatix_ov5675_d5v15b_zsl_video_3a.so
vendor/lib/libchromatix_ov5675_ofilm_common.so
vendor/lib/libchromatix_ov5675_ofilm_cpp_hfr_120.so
vendor/lib/libchromatix_ov5675_ofilm_cpp_hfr_60.so
vendor/lib/libchromatix_ov5675_ofilm_cpp_hfr_90.so
vendor/lib/libchromatix_ov5675_ofilm_cpp_liveshot.so
vendor/lib/libchromatix_ov5675_ofilm_cpp_preview.so
vendor/lib/libchromatix_ov5675_ofilm_cpp_snapshot.so
vendor/lib/libchromatix_ov5675_ofilm_cpp_video.so
vendor/lib/libchromatix_ov5675_ofilm_default_preview_3a.so
vendor/lib/libchromatix_ov5675_ofilm_default_video.so
vendor/lib/libchromatix_ov5675_ofilm_default_video_3a.so
vendor/lib/libchromatix_ov5675_ofilm_hfr_120.so
vendor/lib/libchromatix_ov5675_ofilm_hfr_120_3a.so
vendor/lib/libchromatix_ov5675_ofilm_hfr_60.so
vendor/lib/libchromatix_ov5675_ofilm_hfr_60_3a.so
vendor/lib/libchromatix_ov5675_ofilm_hfr_90.so
vendor/lib/libchromatix_ov5675_ofilm_hfr_90_3a.so
vendor/lib/libchromatix_ov5675_ofilm_liveshot.so
vendor/lib/libchromatix_ov5675_ofilm_postproc.so
vendor/lib/libchromatix_ov5675_ofilm_preview.so
vendor/lib/libchromatix_ov5675_ofilm_snapshot.so
vendor/lib/libchromatix_ov5675_ofilm_zsl_preview_3a.so
vendor/lib/libchromatix_ov5675_ofilm_zsl_video_3a.so
vendor/lib/libchromatix_ov5695_a3_default_preview.so
vendor/lib/libchromatix_ov5695_a3_default_video.so
vendor/lib/libchromatix_ov5695_a3_hfr_120.so
vendor/lib/libchromatix_ov5695_a3_hfr_60.so
vendor/lib/libchromatix_ov5695_a3_hfr_90.so
vendor/lib/libchromatix_ov5695_common.so
vendor/lib/libchromatix_ov5695_cpp_ds_chromatix.so
vendor/lib/libchromatix_ov5695_cpp_hfr_120.so
vendor/lib/libchromatix_ov5695_cpp_hfr_60.so
vendor/lib/libchromatix_ov5695_cpp_hfr_90.so
vendor/lib/libchromatix_ov5695_cpp_liveshot.so
vendor/lib/libchromatix_ov5695_cpp_preview.so
vendor/lib/libchromatix_ov5695_cpp_snapshot.so
vendor/lib/libchromatix_ov5695_cpp_us_chromatix.so
vendor/lib/libchromatix_ov5695_cpp_video.so
vendor/lib/libchromatix_ov5695_cpp_video_full.so
vendor/lib/libchromatix_ov5695_default_video.so
vendor/lib/libchromatix_ov5695_hfr_120.so
vendor/lib/libchromatix_ov5695_hfr_60.so
vendor/lib/libchromatix_ov5695_hfr_90.so
vendor/lib/libchromatix_ov5695_liveshot.so
vendor/lib/libchromatix_ov5695_postproc.so
vendor/lib/libchromatix_ov5695_preview.so
vendor/lib/libchromatix_ov5695_snapshot.so
vendor/lib/libchromatix_ov5695_video_full.so
vendor/lib/libchromatix_ov5695_zsl_preview.so
vendor/lib/libchromatix_ov5695_zsl_video.so
vendor/lib/libchromatix_ov7251_liveshot.so
vendor/lib/libchromatix_ov7251_postproc.so
vendor/lib/libchromatix_ov7251_preview.so
vendor/lib/libchromatix_ov7251_snapshot.so
vendor/lib/libchromatix_ov7251_zsl_preview.so
vendor/lib/libchromatix_ov7251_zsl_video.so
vendor/lib/libchromatix_ov8856_a3_default_preview.so
vendor/lib/libchromatix_ov8856_a3_default_video.so
vendor/lib/libchromatix_ov8856_a3_hfr_120.so
vendor/lib/libchromatix_ov8856_a3_hfr_60.so
vendor/lib/libchromatix_ov8856_a3_hfr_90.so
vendor/lib/libchromatix_ov8856_common.so
vendor/lib/libchromatix_ov8856_cpp_ds_chromatix.so
vendor/lib/libchromatix_ov8856_cpp_hfr_120.so
vendor/lib/libchromatix_ov8856_cpp_hfr_60.so
vendor/lib/libchromatix_ov8856_cpp_hfr_90.so
vendor/lib/libchromatix_ov8856_cpp_liveshot.so
vendor/lib/libchromatix_ov8856_cpp_preview.so
vendor/lib/libchromatix_ov8856_cpp_snapshot.so
vendor/lib/libchromatix_ov8856_cpp_us_chromatix.so
vendor/lib/libchromatix_ov8856_cpp_video.so
vendor/lib/libchromatix_ov8856_default_video.so
vendor/lib/libchromatix_ov8856_hfr_120.so
vendor/lib/libchromatix_ov8856_hfr_60.so
vendor/lib/libchromatix_ov8856_hfr_90.so
vendor/lib/libchromatix_ov8856_liveshot.so
vendor/lib/libchromatix_ov8856_postproc.so
vendor/lib/libchromatix_ov8856_preview.so
vendor/lib/libchromatix_ov8856_snapshot.so
vendor/lib/libchromatix_ov8856_zsl_preview.so
vendor/lib/libchromatix_ov8856_zsl_video.so
vendor/lib/libchromatix_ov8858_a3_default_preview.so
vendor/lib/libchromatix_ov8858_a3_default_video.so
vendor/lib/libchromatix_ov8858_a3_hfr_120.so
vendor/lib/libchromatix_ov8858_a3_hfr_60.so
vendor/lib/libchromatix_ov8858_a3_hfr_90.so
vendor/lib/libchromatix_ov8858_common.so
vendor/lib/libchromatix_ov8858_cpp_ds_chromatix.so
vendor/lib/libchromatix_ov8858_cpp_hfr_120.so
vendor/lib/libchromatix_ov8858_cpp_hfr_60.so
vendor/lib/libchromatix_ov8858_cpp_hfr_90.so
vendor/lib/libchromatix_ov8858_cpp_liveshot.so
vendor/lib/libchromatix_ov8858_cpp_preview.so
vendor/lib/libchromatix_ov8858_cpp_snapshot.so
vendor/lib/libchromatix_ov8858_cpp_us_chromatix.so
vendor/lib/libchromatix_ov8858_cpp_video.so
vendor/lib/libchromatix_ov8858_default_video.so
vendor/lib/libchromatix_ov8858_hfr_120.so
vendor/lib/libchromatix_ov8858_hfr_60.so
vendor/lib/libchromatix_ov8858_hfr_90.so
vendor/lib/libchromatix_ov8858_postproc.so
vendor/lib/libchromatix_ov8858_preview.so
vendor/lib/libchromatix_ov8858_snapshot.so
vendor/lib/libchromatix_ov8858_zsl_preview.so
vendor/lib/libchromatix_ov8858_zsl_video.so
vendor/lib/libchromatix_ov8865_common.so
vendor/lib/libchromatix_ov8865_cpp_ds_chromatix.so
vendor/lib/libchromatix_ov8865_cpp_hfr_120.so
vendor/lib/libchromatix_ov8865_cpp_hfr_60.so
vendor/lib/libchromatix_ov8865_cpp_hfr_90.so
vendor/lib/libchromatix_ov8865_cpp_liveshot.so
vendor/lib/libchromatix_ov8865_cpp_preview.so
vendor/lib/libchromatix_ov8865_cpp_snapshot.so
vendor/lib/libchromatix_ov8865_cpp_us_chromatix.so
vendor/lib/libchromatix_ov8865_cpp_video.so
vendor/lib/libchromatix_ov8865_cpp_video_full.so
vendor/lib/libchromatix_ov8865_default_preview_dw9714.so
vendor/lib/libchromatix_ov8865_default_video.so
vendor/lib/libchromatix_ov8865_default_video_dw9714.so
vendor/lib/libchromatix_ov8865_hfr_120.so
vendor/lib/libchromatix_ov8865_hfr_120_dw9714.so
vendor/lib/libchromatix_ov8865_hfr_60.so
vendor/lib/libchromatix_ov8865_hfr_60_dw9714.so
vendor/lib/libchromatix_ov8865_hfr_90.so
vendor/lib/libchromatix_ov8865_hfr_90_dw9714.so
vendor/lib/libchromatix_ov8865_postproc.so
vendor/lib/libchromatix_ov8865_preview.so
vendor/lib/libchromatix_ov8865_snapshot.so
vendor/lib/libchromatix_ov8865_video_full.so
vendor/lib/libchromatix_ov8865_zsl_preview.so
vendor/lib/libchromatix_ov8865_zsl_video.so
vendor/lib/libchromatix_ovt_ov12a10_i_4K.so
vendor/lib/libchromatix_ovt_ov12a10_i_4K_preview_dw9763.so
vendor/lib/libchromatix_ovt_ov12a10_i_4K_video_dw9763.so
vendor/lib/libchromatix_ovt_ov12a10_i_common.so
vendor/lib/libchromatix_ovt_ov12a10_i_cpp_4K.so
vendor/lib/libchromatix_ovt_ov12a10_i_cpp_hfr_120.so
vendor/lib/libchromatix_ovt_ov12a10_i_cpp_hfr_60.so
vendor/lib/libchromatix_ovt_ov12a10_i_cpp_hfr_90.so
vendor/lib/libchromatix_ovt_ov12a10_i_cpp_liveshot.so
vendor/lib/libchromatix_ovt_ov12a10_i_cpp_preview.so
vendor/lib/libchromatix_ovt_ov12a10_i_cpp_snapshot.so
vendor/lib/libchromatix_ovt_ov12a10_i_cpp_video.so
vendor/lib/libchromatix_ovt_ov12a10_i_default_preview_dw9763.so
vendor/lib/libchromatix_ovt_ov12a10_i_default_video.so
vendor/lib/libchromatix_ovt_ov12a10_i_default_video_dw9763.so
vendor/lib/libchromatix_ovt_ov12a10_i_hfr_120.so
vendor/lib/libchromatix_ovt_ov12a10_i_hfr_120_dw9763.so
vendor/lib/libchromatix_ovt_ov12a10_i_hfr_60.so
vendor/lib/libchromatix_ovt_ov12a10_i_hfr_60_dw9763.so
vendor/lib/libchromatix_ovt_ov12a10_i_hfr_90.so
vendor/lib/libchromatix_ovt_ov12a10_i_hfr_90_dw9763.so
vendor/lib/libchromatix_ovt_ov12a10_i_india_4K.so
vendor/lib/libchromatix_ovt_ov12a10_i_india_4K_preview_dw9763.so
vendor/lib/libchromatix_ovt_ov12a10_i_india_4K_video_dw9763.so
vendor/lib/libchromatix_ovt_ov12a10_i_india_common.so
vendor/lib/libchromatix_ovt_ov12a10_i_india_cpp_4K.so
vendor/lib/libchromatix_ovt_ov12a10_i_india_cpp_hfr_120.so
vendor/lib/libchromatix_ovt_ov12a10_i_india_cpp_hfr_60.so
vendor/lib/libchromatix_ovt_ov12a10_i_india_cpp_hfr_90.so
vendor/lib/libchromatix_ovt_ov12a10_i_india_cpp_liveshot.so
vendor/lib/libchromatix_ovt_ov12a10_i_india_cpp_preview.so
vendor/lib/libchromatix_ovt_ov12a10_i_india_cpp_snapshot.so
vendor/lib/libchromatix_ovt_ov12a10_i_india_cpp_video.so
vendor/lib/libchromatix_ovt_ov12a10_i_india_default_preview_dw9763.so
vendor/lib/libchromatix_ovt_ov12a10_i_india_default_video.so
vendor/lib/libchromatix_ovt_ov12a10_i_india_default_video_dw9763.so
vendor/lib/libchromatix_ovt_ov12a10_i_india_hfr_120.so
vendor/lib/libchromatix_ovt_ov12a10_i_india_hfr_120_dw9763.so
vendor/lib/libchromatix_ovt_ov12a10_i_india_hfr_60.so
vendor/lib/libchromatix_ovt_ov12a10_i_india_hfr_60_dw9763.so
vendor/lib/libchromatix_ovt_ov12a10_i_india_hfr_90.so
vendor/lib/libchromatix_ovt_ov12a10_i_india_hfr_90_dw9763.so
vendor/lib/libchromatix_ovt_ov12a10_i_india_liveshot.so
vendor/lib/libchromatix_ovt_ov12a10_i_india_postproc.so
vendor/lib/libchromatix_ovt_ov12a10_i_india_preview.so
vendor/lib/libchromatix_ovt_ov12a10_i_india_snapshot.so
vendor/lib/libchromatix_ovt_ov12a10_i_india_zsl_preview_dw9763.so
vendor/lib/libchromatix_ovt_ov12a10_i_india_zsl_video_dw9763.so
vendor/lib/libchromatix_ovt_ov12a10_i_liveshot.so
vendor/lib/libchromatix_ovt_ov12a10_i_postproc.so
vendor/lib/libchromatix_ovt_ov12a10_i_preview.so
vendor/lib/libchromatix_ovt_ov12a10_i_snapshot.so
vendor/lib/libchromatix_ovt_ov12a10_i_zsl_preview_dw9763.so
vendor/lib/libchromatix_ovt_ov12a10_i_zsl_video_dw9763.so
vendor/lib/libchromatix_ovt_ov5675_i_common.so
vendor/lib/libchromatix_ovt_ov5675_i_common_torch.so
vendor/lib/libchromatix_ovt_ov5675_i_cpp_hfr_120.so
vendor/lib/libchromatix_ovt_ov5675_i_cpp_hfr_60.so
vendor/lib/libchromatix_ovt_ov5675_i_cpp_hfr_90.so
vendor/lib/libchromatix_ovt_ov5675_i_cpp_liveshot.so
vendor/lib/libchromatix_ovt_ov5675_i_cpp_liveshot_torch.so
vendor/lib/libchromatix_ovt_ov5675_i_cpp_preview.so
vendor/lib/libchromatix_ovt_ov5675_i_cpp_preview_torch.so
vendor/lib/libchromatix_ovt_ov5675_i_cpp_snapshot.so
vendor/lib/libchromatix_ovt_ov5675_i_cpp_snapshot_torch.so
vendor/lib/libchromatix_ovt_ov5675_i_cpp_video.so
vendor/lib/libchromatix_ovt_ov5675_i_cpp_video_torch.so
vendor/lib/libchromatix_ovt_ov5675_i_default_preview_3a.so
vendor/lib/libchromatix_ovt_ov5675_i_default_preview_3a_torch.so
vendor/lib/libchromatix_ovt_ov5675_i_default_video.so
vendor/lib/libchromatix_ovt_ov5675_i_default_video_3a.so
vendor/lib/libchromatix_ovt_ov5675_i_default_video_3a_torch.so
vendor/lib/libchromatix_ovt_ov5675_i_hfr_120.so
vendor/lib/libchromatix_ovt_ov5675_i_hfr_120_3a.so
vendor/lib/libchromatix_ovt_ov5675_i_hfr_60.so
vendor/lib/libchromatix_ovt_ov5675_i_hfr_60_3a.so
vendor/lib/libchromatix_ovt_ov5675_i_hfr_90.so
vendor/lib/libchromatix_ovt_ov5675_i_hfr_90_3a.so
vendor/lib/libchromatix_ovt_ov5675_i_india_common.so
vendor/lib/libchromatix_ovt_ov5675_i_india_common_torch.so
vendor/lib/libchromatix_ovt_ov5675_i_india_cpp_hfr_120.so
vendor/lib/libchromatix_ovt_ov5675_i_india_cpp_hfr_60.so
vendor/lib/libchromatix_ovt_ov5675_i_india_cpp_hfr_90.so
vendor/lib/libchromatix_ovt_ov5675_i_india_cpp_liveshot.so
vendor/lib/libchromatix_ovt_ov5675_i_india_cpp_liveshot_torch.so
vendor/lib/libchromatix_ovt_ov5675_i_india_cpp_preview.so
vendor/lib/libchromatix_ovt_ov5675_i_india_cpp_preview_torch.so
vendor/lib/libchromatix_ovt_ov5675_i_india_cpp_snapshot.so
vendor/lib/libchromatix_ovt_ov5675_i_india_cpp_snapshot_torch.so
vendor/lib/libchromatix_ovt_ov5675_i_india_cpp_video.so
vendor/lib/libchromatix_ovt_ov5675_i_india_cpp_video_torch.so
vendor/lib/libchromatix_ovt_ov5675_i_india_default_preview_3a.so
vendor/lib/libchromatix_ovt_ov5675_i_india_default_preview_3a_torch.so
vendor/lib/libchromatix_ovt_ov5675_i_india_default_video.so
vendor/lib/libchromatix_ovt_ov5675_i_india_default_video_3a.so
vendor/lib/libchromatix_ovt_ov5675_i_india_default_video_3a_torch.so
vendor/lib/libchromatix_ovt_ov5675_i_india_hfr_120.so
vendor/lib/libchromatix_ovt_ov5675_i_india_hfr_120_3a.so
vendor/lib/libchromatix_ovt_ov5675_i_india_hfr_60.so
vendor/lib/libchromatix_ovt_ov5675_i_india_hfr_60_3a.so
vendor/lib/libchromatix_ovt_ov5675_i_india_hfr_90.so
vendor/lib/libchromatix_ovt_ov5675_i_india_hfr_90_3a.so
vendor/lib/libchromatix_ovt_ov5675_i_india_liveshot.so
vendor/lib/libchromatix_ovt_ov5675_i_india_postproc.so
vendor/lib/libchromatix_ovt_ov5675_i_india_postproc_torch.so
vendor/lib/libchromatix_ovt_ov5675_i_india_preview.so
vendor/lib/libchromatix_ovt_ov5675_i_india_snapshot.so
vendor/lib/libchromatix_ovt_ov5675_i_india_snapshot_torch.so
vendor/lib/libchromatix_ovt_ov5675_i_india_zsl_preview_3a.so
vendor/lib/libchromatix_ovt_ov5675_i_india_zsl_preview_3a_torch.so
vendor/lib/libchromatix_ovt_ov5675_i_india_zsl_video_3a.so
vendor/lib/libchromatix_ovt_ov5675_i_india_zsl_video_3a_torch.so
vendor/lib/libchromatix_ovt_ov5675_i_liveshot.so
vendor/lib/libchromatix_ovt_ov5675_i_postproc.so
vendor/lib/libchromatix_ovt_ov5675_i_postproc_torch.so
vendor/lib/libchromatix_ovt_ov5675_i_preview.so
vendor/lib/libchromatix_ovt_ov5675_i_snapshot.so
vendor/lib/libchromatix_ovt_ov5675_i_snapshot_torch.so
vendor/lib/libchromatix_ovt_ov5675_i_zsl_preview_3a.so
vendor/lib/libchromatix_ovt_ov5675_i_zsl_preview_3a_torch.so
vendor/lib/libchromatix_ovt_ov5675_i_zsl_video_3a.so
vendor/lib/libchromatix_ovt_ov5675_i_zsl_video_3a_torch.so
vendor/lib/libchromatix_ovt_ov5675_ii_common.so
vendor/lib/libchromatix_ovt_ov5675_ii_common_torch.so
vendor/lib/libchromatix_ovt_ov5675_ii_cpp_hfr_120.so
vendor/lib/libchromatix_ovt_ov5675_ii_cpp_hfr_60.so
vendor/lib/libchromatix_ovt_ov5675_ii_cpp_hfr_90.so
vendor/lib/libchromatix_ovt_ov5675_ii_cpp_liveshot.so
vendor/lib/libchromatix_ovt_ov5675_ii_cpp_liveshot_torch.so
vendor/lib/libchromatix_ovt_ov5675_ii_cpp_preview.so
vendor/lib/libchromatix_ovt_ov5675_ii_cpp_preview_torch.so
vendor/lib/libchromatix_ovt_ov5675_ii_cpp_snapshot.so
vendor/lib/libchromatix_ovt_ov5675_ii_cpp_snapshot_torch.so
vendor/lib/libchromatix_ovt_ov5675_ii_cpp_video.so
vendor/lib/libchromatix_ovt_ov5675_ii_cpp_video_torch.so
vendor/lib/libchromatix_ovt_ov5675_ii_default_preview_3a.so
vendor/lib/libchromatix_ovt_ov5675_ii_default_preview_3a_torch.so
vendor/lib/libchromatix_ovt_ov5675_ii_default_video.so
vendor/lib/libchromatix_ovt_ov5675_ii_default_video_3a.so
vendor/lib/libchromatix_ovt_ov5675_ii_default_video_3a_torch.so
vendor/lib/libchromatix_ovt_ov5675_ii_hfr_120.so
vendor/lib/libchromatix_ovt_ov5675_ii_hfr_120_3a.so
vendor/lib/libchromatix_ovt_ov5675_ii_hfr_60.so
vendor/lib/libchromatix_ovt_ov5675_ii_hfr_60_3a.so
vendor/lib/libchromatix_ovt_ov5675_ii_hfr_90.so
vendor/lib/libchromatix_ovt_ov5675_ii_hfr_90_3a.so
vendor/lib/libchromatix_ovt_ov5675_ii_india_common.so
vendor/lib/libchromatix_ovt_ov5675_ii_india_common_torch.so
vendor/lib/libchromatix_ovt_ov5675_ii_india_cpp_hfr_120.so
vendor/lib/libchromatix_ovt_ov5675_ii_india_cpp_hfr_60.so
vendor/lib/libchromatix_ovt_ov5675_ii_india_cpp_hfr_90.so
vendor/lib/libchromatix_ovt_ov5675_ii_india_cpp_liveshot.so
vendor/lib/libchromatix_ovt_ov5675_ii_india_cpp_liveshot_torch.so
vendor/lib/libchromatix_ovt_ov5675_ii_india_cpp_preview.so
vendor/lib/libchromatix_ovt_ov5675_ii_india_cpp_preview_torch.so
vendor/lib/libchromatix_ovt_ov5675_ii_india_cpp_snapshot.so
vendor/lib/libchromatix_ovt_ov5675_ii_india_cpp_snapshot_torch.so
vendor/lib/libchromatix_ovt_ov5675_ii_india_cpp_video.so
vendor/lib/libchromatix_ovt_ov5675_ii_india_cpp_video_torch.so
vendor/lib/libchromatix_ovt_ov5675_ii_india_default_preview_3a.so
vendor/lib/libchromatix_ovt_ov5675_ii_india_default_preview_3a_torch.so
vendor/lib/libchromatix_ovt_ov5675_ii_india_default_video.so
vendor/lib/libchromatix_ovt_ov5675_ii_india_default_video_3a.so
vendor/lib/libchromatix_ovt_ov5675_ii_india_default_video_3a_torch.so
vendor/lib/libchromatix_ovt_ov5675_ii_india_hfr_120.so
vendor/lib/libchromatix_ovt_ov5675_ii_india_hfr_120_3a.so
vendor/lib/libchromatix_ovt_ov5675_ii_india_hfr_60.so
vendor/lib/libchromatix_ovt_ov5675_ii_india_hfr_60_3a.so
vendor/lib/libchromatix_ovt_ov5675_ii_india_hfr_90.so
vendor/lib/libchromatix_ovt_ov5675_ii_india_hfr_90_3a.so
vendor/lib/libchromatix_ovt_ov5675_ii_india_liveshot.so
vendor/lib/libchromatix_ovt_ov5675_ii_india_postproc.so
vendor/lib/libchromatix_ovt_ov5675_ii_india_postproc_torch.so
vendor/lib/libchromatix_ovt_ov5675_ii_india_preview.so
vendor/lib/libchromatix_ovt_ov5675_ii_india_snapshot.so
vendor/lib/libchromatix_ovt_ov5675_ii_india_snapshot_torch.so
vendor/lib/libchromatix_ovt_ov5675_ii_india_zsl_preview_3a.so
vendor/lib/libchromatix_ovt_ov5675_ii_india_zsl_preview_3a_torch.so
vendor/lib/libchromatix_ovt_ov5675_ii_india_zsl_video_3a.so
vendor/lib/libchromatix_ovt_ov5675_ii_india_zsl_video_3a_torch.so
vendor/lib/libchromatix_ovt_ov5675_ii_liveshot.so
vendor/lib/libchromatix_ovt_ov5675_ii_postproc.so
vendor/lib/libchromatix_ovt_ov5675_ii_postproc_torch.so
vendor/lib/libchromatix_ovt_ov5675_ii_preview.so
vendor/lib/libchromatix_ovt_ov5675_ii_snapshot.so
vendor/lib/libchromatix_ovt_ov5675_ii_snapshot_torch.so
vendor/lib/libchromatix_ovt_ov5675_ii_zsl_preview_3a.so
vendor/lib/libchromatix_ovt_ov5675_ii_zsl_preview_3a_torch.so
vendor/lib/libchromatix_ovt_ov5675_ii_zsl_video_3a.so
vendor/lib/libchromatix_ovt_ov5675_ii_zsl_video_3a_torch.so
vendor/lib/libchromatix_sony_imx486_ii_common.so
vendor/lib/libchromatix_sony_imx486_ii_cpp_hfr_120.so
vendor/lib/libchromatix_sony_imx486_ii_cpp_hfr_60.so
vendor/lib/libchromatix_sony_imx486_ii_cpp_hfr_90.so
vendor/lib/libchromatix_sony_imx486_ii_cpp_liveshot.so
vendor/lib/libchromatix_sony_imx486_ii_cpp_preview.so
vendor/lib/libchromatix_sony_imx486_ii_cpp_snapshot.so
vendor/lib/libchromatix_sony_imx486_ii_cpp_video.so
vendor/lib/libchromatix_sony_imx486_ii_default_preview_dw9714v.so
vendor/lib/libchromatix_sony_imx486_ii_default_video.so
vendor/lib/libchromatix_sony_imx486_ii_default_video_dw9714v.so
vendor/lib/libchromatix_sony_imx486_ii_hfr_120.so
vendor/lib/libchromatix_sony_imx486_ii_hfr_120_dw9714v.so
vendor/lib/libchromatix_sony_imx486_ii_hfr_60.so
vendor/lib/libchromatix_sony_imx486_ii_hfr_60_dw9714v.so
vendor/lib/libchromatix_sony_imx486_ii_hfr_90.so
vendor/lib/libchromatix_sony_imx486_ii_hfr_90_dw9714v.so
vendor/lib/libchromatix_sony_imx486_ii_india_common.so
vendor/lib/libchromatix_sony_imx486_ii_india_cpp_hfr_120.so
vendor/lib/libchromatix_sony_imx486_ii_india_cpp_hfr_60.so
vendor/lib/libchromatix_sony_imx486_ii_india_cpp_hfr_90.so
vendor/lib/libchromatix_sony_imx486_ii_india_cpp_liveshot.so
vendor/lib/libchromatix_sony_imx486_ii_india_cpp_preview.so
vendor/lib/libchromatix_sony_imx486_ii_india_cpp_snapshot.so
vendor/lib/libchromatix_sony_imx486_ii_india_cpp_video.so
vendor/lib/libchromatix_sony_imx486_ii_india_default_preview_dw9714v.so
vendor/lib/libchromatix_sony_imx486_ii_india_default_video.so
vendor/lib/libchromatix_sony_imx486_ii_india_default_video_dw9714v.so
vendor/lib/libchromatix_sony_imx486_ii_india_hfr_120.so
vendor/lib/libchromatix_sony_imx486_ii_india_hfr_120_dw9714v.so
vendor/lib/libchromatix_sony_imx486_ii_india_hfr_60.so
vendor/lib/libchromatix_sony_imx486_ii_india_hfr_60_dw9714v.so
vendor/lib/libchromatix_sony_imx486_ii_india_hfr_90.so
vendor/lib/libchromatix_sony_imx486_ii_india_hfr_90_dw9714v.so
vendor/lib/libchromatix_sony_imx486_ii_india_postproc.so
vendor/lib/libchromatix_sony_imx486_ii_india_preview.so
vendor/lib/libchromatix_sony_imx486_ii_india_snapshot.so
vendor/lib/libchromatix_sony_imx486_ii_india_zsl_preview_dw9714v.so
vendor/lib/libchromatix_sony_imx486_ii_india_zsl_video_dw9714v.so
vendor/lib/libchromatix_sony_imx486_ii_postproc.so
vendor/lib/libchromatix_sony_imx486_ii_preview.so
vendor/lib/libchromatix_sony_imx486_ii_snapshot.so
vendor/lib/libchromatix_sony_imx486_ii_zsl_preview_dw9714v.so
vendor/lib/libchromatix_sony_imx486_ii_zsl_video_dw9714v.so

# mmcamera from MIUI Stable - V9.2.3.0.NDAMIEK
vendor/lib/libmmcamera_atmel_at24c32e_eeprom.so
vendor/lib/libmmcamera_cac3_lib.so
vendor/lib/libmmcamera_chromaflash_lib.so
vendor/lib/libmmcamera_csidtg.so
vendor/lib/libmmcamera_dbg.so|f0146e9d43f24c08f14d25dd460aaa02f5c6822d
vendor/lib/libmmcamera_dcrf_lib.so
vendor/lib/libmmcamera_dummyalgo.so
vendor/lib/libmmcamera_dw9761b_2d_eeprom.so
vendor/lib/libmmcamera_eebinparse.so
vendor/lib/libmmcamera_eeprom_util.so
vendor/lib/libmmcamera_eztune_module.so
vendor/lib/libmmcamera_facedetection_lib.so
vendor/lib/libmmcamera_faceproc.so
vendor/lib/libmmcamera_faceproc2.so
vendor/lib/libmmcamera_hdr_gb_lib.so
vendor/lib/libmmcamera_imglib.so|caaf376021a1c2d30a8e9c25b6df9f2cd9be2c8d
vendor/lib/libmmcamera_isp_abf40.so
vendor/lib/libmmcamera_isp_bcc40.so
vendor/lib/libmmcamera_isp_be_stats44.so
vendor/lib/libmmcamera_isp_bf_stats47.so
vendor/lib/libmmcamera_isp_bg_stats44.so
vendor/lib/libmmcamera_isp_bhist_stats44.so
vendor/lib/libmmcamera_isp_bpc40.so
vendor/lib/libmmcamera_isp_chroma_enhan40.so
vendor/lib/libmmcamera_isp_chroma_suppress40.so
vendor/lib/libmmcamera_isp_clamp_encoder40.so
vendor/lib/libmmcamera_isp_clamp_video40.so
vendor/lib/libmmcamera_isp_clamp_viewfinder40.so
vendor/lib/libmmcamera_isp_color_correct40.so
vendor/lib/libmmcamera_isp_color_xform_encoder40.so
vendor/lib/libmmcamera_isp_color_xform_viewfinder40.so
vendor/lib/libmmcamera_isp_cs_stats44.so
vendor/lib/libmmcamera_isp_demosaic40.so
vendor/lib/libmmcamera_isp_demux40.so
vendor/lib/libmmcamera_isp_fovcrop_encoder40.so
vendor/lib/libmmcamera_isp_fovcrop_viewfinder40.so
vendor/lib/libmmcamera_isp_gamma40.so
vendor/lib/libmmcamera_isp_ihist_stats44.so
vendor/lib/libmmcamera_isp_linearization40.so
vendor/lib/libmmcamera_isp_ltm44.so
vendor/lib/libmmcamera_isp_luma_adaptation40.so
vendor/lib/libmmcamera_isp_mce40.so
vendor/lib/libmmcamera_isp_mesh_rolloff40.so
vendor/lib/libmmcamera_isp_rs_stats44.so
vendor/lib/libmmcamera_isp_scaler_encoder44.so
vendor/lib/libmmcamera_isp_scaler_viewfinder44.so
vendor/lib/libmmcamera_isp_sce40.so
vendor/lib/libmmcamera_isp_sub_module.so
vendor/lib/libmmcamera_isp_template.so
vendor/lib/libmmcamera_isp_wb40.so
vendor/lib/libmmcamera_le2464c_eeprom.so
vendor/lib/libmmcamera_le2464c_master_eeprom.so
vendor/lib/libmmcamera_llvd.so
vendor/lib/libmmcamera_onsemi_cat24c16_eeprom.so
vendor/lib/libmmcamera_onsemi_cat24c32_eeprom.so
vendor/lib/libmmcamera_optizoom_lib.so
vendor/lib/libmmcamera_ov13850.so
vendor/lib/libmmcamera_ov13850_eeprom.so
vendor/lib/libmmcamera_ov13850_q13v06k.so
vendor/lib/libmmcamera_ov13855_qtech.so
vendor/lib/libmmcamera_ov13855_qtech_eeprom.so
vendor/lib/libmmcamera_ov13855_sunny.so
vendor/lib/libmmcamera_ov13855_sunny_eeprom.so
vendor/lib/libmmcamera_ov2281.so
vendor/lib/libmmcamera_ov2680.so
vendor/lib/libmmcamera_ov2685.so
vendor/lib/libmmcamera_ov2685_scv3b4035.so
vendor/lib/libmmcamera_ov4688.so
vendor/lib/libmmcamera_ov4688_eeprom.so
vendor/lib/libmmcamera_ov5645.so
vendor/lib/libmmcamera_ov5670.so
vendor/lib/libmmcamera_ov5675.so
vendor/lib/libmmcamera_ov5675_eeprom.so
vendor/lib/libmmcamera_ov5675_ofilm.so
vendor/lib/libmmcamera_ov5675_ofilm_eeprom.so
vendor/lib/libmmcamera_ov5695.so
vendor/lib/libmmcamera_ov7251.so
vendor/lib/libmmcamera_ov8856.so
vendor/lib/libmmcamera_ov8858.so
vendor/lib/libmmcamera_ov8865.so
vendor/lib/libmmcamera_ovt_ov12a10_i.so
vendor/lib/libmmcamera_ovt_ov12a10_i_eeprom.so
vendor/lib/libmmcamera_ovt_ov5675_i.so
vendor/lib/libmmcamera_ovt_ov5675_i_eeprom.so
vendor/lib/libmmcamera_ovt_ov5675_ii.so
vendor/lib/libmmcamera_ovt_ov5675_ii_eeprom.so
vendor/lib/libmmcamera_paaf_lib.so
vendor/lib/libmmcamera_pdaf.so|0e60d7259663e802e2cd56afb477153c40712aea
vendor/lib/libmmcamera_pdafcamif.so|b78b79d1e0211adfb06a704ba45bb92256360034
vendor/lib/libmmcamera_ppbase_module.so
vendor/lib/libmmcamera_ppeiscore.so|dd9206cfbbd6f2d5837c77326366da4b4f9af53d
vendor/lib/libmmcamera_qtech_f3l8yam_eeprom.so
vendor/lib/libmmcamera_qtech_f5670bq_eeprom.so
vendor/lib/libmmcamera_quadracfa.so
vendor/lib/libmmcamera_rohm_brcg064gwz_3_eeprom.so
vendor/lib/libmmcamera_sony_imx486_ii.so
vendor/lib/libmmcamera_sony_imx486_ii_eeprom.so
vendor/lib/libmmcamera_sonyimx135_eeprom.so
vendor/lib/libmmcamera_stillmore_lib.so
vendor/lib/libmmcamera_sunny_8865_eeprom.so
vendor/lib/libmmcamera_sunny_q13v06k_eeprom.so
vendor/lib/libmmcamera_sunny_q5v41b_eeprom.so
vendor/lib/libmmcamera_sw2d_lib.so
vendor/lib/libmmcamera_thread_services.so
vendor/lib/libmmcamera_tintless_algo.so|913ba6a0f7c039c037e73dd8a12153a70fd5b25b
vendor/lib/libmmcamera_tintless_bg_pca_algo.so|13b2019476cc7497ffec38215bfa81b0576df914
vendor/lib/libmmcamera_trueportrait_lib.so
vendor/lib/libmmcamera_truly_cma481_eeprom.so
vendor/lib/libmmcamera_truly_cmb433_eeprom.so
vendor/lib/libmmcamera_tuning.so|d08d6912ebf02b6929826b4fe4de36e9ce54dbad
vendor/lib/libmmcamera_tuning_lookup.so
vendor/lib/libmmcamera_ubifocus_lib.so
vendor/lib64/libmmcamera_cac3_lib.so
vendor/lib64/libmmcamera_dbg.so|e803179ee307d532307305a91d95810bd1ea516a
vendor/lib64/libmmcamera_tintless_algo.so|949178b97c5c39f3ce1d4bc5327661ca685ed26a
vendor/lib64/libmmcamera_tintless_bg_pca_algo.so|e47d0a7fbf506940df682b4ba3457282dbfc8bc9
vendor/lib/libmmcamera2_c2d_module.so
vendor/lib/libmmcamera2_cpp_module.so|8d376760a19396ab54e1dad710a5bfe35ae6c34a
vendor/lib/libmmcamera2_dcrf.so|7c55d9960f1db2fd79649527b03fe2b0c540e6d4
vendor/lib/libmmcamera2_frame_algorithm.so
vendor/lib/libmmcamera2_iface_modules.so|fc4078f79abf5a74159803f45deda206361eef04
vendor/lib/libmmcamera2_imglib_modules.so|31eb3a267516bef3f0515fb6e228e2317ffa5d02
vendor/lib/libmmcamera2_is.so
vendor/lib/libmmcamera2_isp_modules.so
vendor/lib/libmmcamera2_mct.so|00eb1298c0a21993e2a2de3d2a7e946ece06e82b
vendor/lib/libmmcamera2_mct_shimlayer.so
vendor/lib/libmmcamera2_pp_buf_mgr.so
vendor/lib/libmmcamera2_pproc_modules.so|c32b3ea9aea83450365c1c7e0e0abfdece5e7f9c
vendor/lib/libmmcamera2_q3a_core.so|ebe1bdb36ceb8966b0de3d82f286663270049b59
vendor/lib/libmmcamera2_sensor_modules.so|d68c15cf80530a9a0bd2a00b80d16f2b16597ba3
vendor/lib/libmmcamera2_stats_algorithm.so|b958d112ec0a55aca7e526e2bb1b4ffe9ae3f735
vendor/lib/libmmcamera2_stats_modules.so|9320b946ce086862e3cbdcac46afd2e839980f75
vendor/lib64/libmmcamera2_frame_algorithm.so
vendor/lib64/libmmcamera2_is.so
vendor/lib64/libmmcamera2_q3a_core.so|33a96b68ed0fcb48f9226bb6378276347c98d24a
vendor/lib64/libmmcamera2_stats_algorithm.so|5df2e23f6019e86da7b9b1d6d4df41c22ad7046d

# Camera firmware from MIUI Stable - V9.2.3.0.NDAMIEK
vendor/firmware/cpp_firmware_v1_1_1.fw
vendor/firmware/cpp_firmware_v1_1_6.fw
vendor/firmware/cpp_firmware_v1_2_0.fw
vendor/firmware/cpp_firmware_v1_4_0.fw
vendor/firmware/cpp_firmware_v1_5_0.fw
vendor/firmware/cpp_firmware_v1_5_2.fw
vendor/firmware/cpp_firmware_v1_6_0.fw
vendor/firmware/cpp_firmware_v1_8_0.fw
vendor/firmware/cpp_firmware_v1_10_0.fw
vendor/firmware/cpp_firmware_v1_12_0.fw

# Charger - from FP3-REL-6.A.020.0-gms-88126537-user
vendor/bin/hvdcp_opti|97711263a9477ed36bed0558cae10d9329c369d9

# Consumerir - from rosy:8.1.0/OPM1.171019.026/V11.0.2.0.ODAMIXM
vendor/lib/hw/consumerir.default.so|b836d25b42b12e88ab0ff4e47c08321a6ddc5285
vendor/lib64/hw/consumerir.default.so|c7f8fb64d8bda3b16f81700b6d0549e5e2d99531

# DPM - from FP3-REL-6.A.020.0-gms-88126537-user
framework/tcmclient.jar|cdd1ea7143a5a7acc3909b5cfa706650179647c7
system_ext/bin/dpmd|dc94ffe90c6658b0bc99c64f68517c4048d0321a
system_ext/etc/dpm/dpm.conf|95e27da8c989e96c6faea6f0697bce11955b62a5
system_ext/etc/init/dpmd.rc|738b638ff04cda368e22c03e16baf90ba157a6fc
system_ext/etc/permissions/com.qti.dpmframework.xml|c4b7ad0879d00c1eba4f3fe3a88ddb8aa153629a
system_ext/etc/permissions/dpmapi.xml|9158c9789cc7135a685b3fb27f8cc27108b51fef
system_ext/framework/com.qti.dpmframework.jar|96a29e28b3abffb9223daadd67459e3f5a3271df
system_ext/framework/dpmapi.jar|2e2fbe2257a697b96a644c774136da0554430d3f
system_ext/lib64/com.qualcomm.qti.dpm.api@1.0.so|b992e1f565f7b8b814eac0c88517543e6d0de603
system_ext/lib64/libdpmctmgr.so|8a687fce30df9483a96065e6cc4154f03562dfa9
system_ext/lib64/libdpmfdmgr.so|bf3666db17e77da3a303c10579baec0bd018089f
system_ext/lib64/libdpmframework.so|235fbb48b47baebd48dbe56f72c77d97ca12c07c
system_ext/lib64/libdpmtcm.so|dff3d3dbacd18ed55b5758a174f5016ef9e7a896
-system_ext/priv-app/dpmserviceapp/dpmserviceapp.apk|9e64514b1bba80c90fec15e9b44628f9a993b8b1
vendor/bin/dpmQmiMgr|61a421804559b0e461439c19088acc01b871982a
vendor/etc/init/dpmQmiMgr.rc|1538743661a5c48c15cd105beaad20f72953885a
vendor/lib64/com.qualcomm.qti.dpm.api@1.0.so|d9f1aa7f93b928f42499d613d20ccbc60f279097
vendor/lib64/libdpmqmihal.so|41eb89e66ba065c43a5eb79cd3c72cef0ee167aa

# DSP - from FP3-REL-6.A.020.0-gms-88126537-user
vendor/bin/dspservice|a7344fc3d27a49df30858ebc3f73ee5818e752d4
vendor/etc/init/vendor.qti.hardware.dsp@1.0-service.rc|fbf2bb38ca6bdddf98c7123da9e1f263a4eec55f
vendor/etc/seccomp_policy/vendor.qti.hardware.dsp.policy|f060101b26d3674bb173e5fc95e118f56a8ac15d
vendor/lib64/vendor.qti.hardware.dsp@1.0.so|b6fa958d634eed5748c8f359b9104e2edf5aa20f

# DRM - from FP3:11-8901.4.A.001
vendor/bin/qseecomd|5b40595c23a54d13fb611311a4ab9b22a9428e86
vendor/lib/libQSEEComAPI.so|2ab0e804dfc482a60a8f02247a6adf2435a41e6d
vendor/lib64/libGPreqcancel.so|b9efbc8623981e1249ad0a0f8964b2b655d2b334
vendor/lib64/libGPreqcancel_svc.so|d539a9c7368973264e71700824b21ce8e5339441
vendor/lib64/libQSEEComAPI.so|c94db2c194c9edebe5e6c40d63bec1589432d62e
vendor/lib64/libSecureUILib.so|19e0cd0438cf94953722355357e1a42a3209216e
vendor/lib64/libStDrvInt.so|1161fc5b029125b2ac87a27e88555c14725f182f
vendor/lib64/libcpion.so|dbeb95d8792600f9113ba24dfea10a9534eeb5fb
vendor/lib64/libdrmfs.so|95da701370dd40644baab29d60a6613888ce1ea0
vendor/lib64/libdrmtime.so|ca5000d5e7f7c16f197fc669f7a5170023d2e4c9
vendor/lib64/liboemcrypto.so|e3e33a8c537824eb37e5fe90ecf5976b446fd052
vendor/lib64/libqisl.so|c79719eebc094c2af9561e8df2c158638b111b70
vendor/lib64/librpmb.so|4ae66b5b5d27b0302bb1d0a5f2396958ed8209c9
vendor/lib64/libsecureui.so|1cb5b3e219c31b6fe5e7ba5b27d434e045e085ed
vendor/lib64/libsecureui_svcsock.so|ba9f7aa7605e54110afea5d9921381f6e6d71a19
vendor/lib64/libssd.so|5b9ac8a457118b1e1b80f87fdc0e78d916ee099a

# DRM - from Redmi/lmi/lmi:11/RKQ1.200826.002/20.10.19:user/release-keys
vendor/lib64/libops.so|b2223e64db9d8f84262da7a8621013d3c63b6c98
vendor/lib64/libspl.so|0fa8c0711f72fc8a914dce044cf8dddd79ee62e1

# DRM-Widevine - from FP3:11-8901.4.A.001
vendor/bin/hw/android.hardware.drm@1.3-service.widevine|ba2ece25131db91901f3adc9b928edb08c181bf9
vendor/etc/init/android.hardware.drm@1.3-service.widevine.rc|a9ce64f68c86725c06c1b1429e90b04ff96ebf60
-vendor/etc/vintf/manifest/manifest_android.hardware.drm@1.3-service.widevine.xml|ebebcf8f367641480cf7d512fc06e6ab777527be
vendor/lib64/libwvhidl.so|f16af38ac55b6df46614df0698ead5a4d2230d65

# Display-calibration - from rosy:8.1.0/OPM1.171019.026/V11.0.2.0.ODAMIXM
vendor/etc/qdcm_calib_data_ft8006m_boe_5p7_720p_video.xml|beb50377ce04f8903527945228ac83c5739bc61a
vendor/etc/qdcm_calib_data_ft8613_csot_5p7_720p_video.xml|cc56ac37178aa9081141fbe6702825901f363ee0
vendor/etc/qdcm_calib_data_ft8613_ebbg_5p7_720p_video.xml|5d2e49b80dffa42e281b930bd040c029ecceaec9

# FM - from FP3-REL-6.A.020.0-gms-88126537-user
system_ext/lib64/fm_helium.so|55ef376cc802574df92025bebaba1cebcc74a918
system_ext/lib64/libfm-hci.so|0cfbf3d84724428721973cc7ad22f5d1e1368591
vendor/lib64/hw/vendor.qti.hardware.fm@1.0-impl.so|66c50040a46dfa7fcefda85ddd009bff2b76f6b8
vendor/lib64/vendor.qti.hardware.fm@1.0.so|a7c3fdcdfdf2d982b04baa89e0e4dc5f5d505bf7

# Fingerprint - from rosy:8.1.0/OPM1.171019.026/V11.0.2.0.ODAMIXM
framework/vendor.qti.hardware.fingerprint-V1.0-java.jar:vendor/framework/vendor.qti.hardware.fingerprint-V1.0-java.jar|9899f8648755f72528128876c64f926887c853fc
lib/android.hardware.biometrics.fingerprint@2.1.so:vendor/lib/android.hardware.biometrics.fingerprint@2.1.so|f060344dba35046ba4cc8e1946f6b7d9883ddf88
lib/libunwind.so:vendor/lib/libunwind.so|1ae75f79380a80a7ea23096250e90fe8854b1bdd
lib64/android.hardware.biometrics.fingerprint@2.1.so:vendor/lib64/android.hardware.biometrics.fingerprint@2.1.so|dbb611d0f8d6f757efe99d67ff335b0a48a705c9
lib64/libunwind.so:vendor/lib64/libunwind.so|dc4dde0652ea158c4584db68337801188ec5ec75
lib/libsoftkeymaster.so:vendor/lib/libsoftkeymaster.so|eb30065dcb28a60c9ecdadfc03ef80c63eeb29fa
lib64/hw/goodixfingerprint.default.so:vendor/lib64/hw/goodixfingerprint.default.so|7ad2e110368c6f240ab496d63b32cfc389a46960
lib64/libgf_ca.so:vendor/lib64/libgf_ca.so|1e660ef345c1339455c86be2dfac3375e12c6957
lib64/libgf_hal.so:vendor/lib64/libgf_hal.so|5fc203e4706c6f30bba5183552f2575ffce5d9f9
lib64/libgoodixfingerprintd_binder.so:vendor/lib64/libgoodixfingerprintd_binder.so|64c4dd469056ef33d7f8249b7d32914ebfdd92fd
lib64/libsoftkeymaster.so:vendor/lib64/libsoftkeymaster.so|97c5607ff9a484b4af967651ed0b1699b2aa98e5
lib64/libvendor.goodix.hardware.fingerprint@1.0-service.so:vendor/lib64/libvendor.goodix.hardware.fingerprint@1.0-service.so|f5a37d3cadeb109beb3caed88f9effebd0d4bb99
lib64/libvendor.goodix.hardware.fingerprint@1.0.so:vendor/lib64/libvendor.goodix.hardware.fingerprint@1.0.so|3767dc08155748e4153ccd8299f14aaac928817b
-vendor/app/FingerprintExtensionService/FingerprintExtensionService.apk|bf9c0b41849804f41955d484aa4f94215e03a16d
vendor/bin/hw/android.hardware.biometrics.fingerprint@2.1-service|866bc21e9de56a76d19c0a91e20486372da621d6
vendor/etc/init/android.hardware.biometrics.fingerprint@2.1-service.rc|ed6a454cfcd9c4183dc85d5d812fd19ae820072c
-vendor/etc/vintf/manifest/android.hardware.biometrics.fingerprint@2.1-service.xml|49e82d6a43981e254d224dcc93b3ff27e0fb8407
vendor/etc/permissions/com.fingerprints.extension.xml|de711d8827e1d321b22b60fd75a204e8928f9c6d
vendor/framework/com.fingerprints.extension.jar|87aa4c45e885ad87870899c7d79fa597704afd83
vendor/lib/vendor.qti.hardware.fingerprint@1.0.so|75c72e927d7fa93593c843f5831ca9137e5eca6a
vendor/lib64/hw/fpcfingerprint.default.so|a78408bdf0833a70666bf0eb7449399dfc6952b4
vendor/lib64/com.fingerprints.extension@1.0.so|3ddbd2a151d417c877ea79686eb0c0f99f925e44
vendor/lib64/vendor.qti.hardware.fingerprint@1.0.so|8cfebb5c7bfe3bd9537e91c7094d7b87bc828f9f

# Firmware - from rosy:8.1.0/OPM1.171019.026/V11.0.2.0.ODAMIXM
vendor/firmware/a225p5_pm4.fw|02e5fb26c121d388104bc6a0f31811dfa91f1828
vendor/firmware/a225_pfp.fw|7ba4003796285d36c125fabe453b45d5e21850cc
vendor/firmware/a225_pm4.fw|87d6f27ca08b521cc3361f63f0631a1fef2403ac
vendor/firmware/a300_pfp.fw|899dbfad4812084971cfc1ff30f06a4b45c2d34c
vendor/firmware/a300_pm4.fw|94529206b45b6e9f6ed30dadabe4244a88a60975
vendor/firmware/a330_pfp.fw|3e2fcee7276ded819cf2d95864fdd6788a484ee1
vendor/firmware/a330_pm4.fw|ae739ea812f9e4462d7bba8b9ead5782d4496618
vendor/firmware/a420_pfp.fw|ceb61d9f1385b3f2956d72f33e0bd43cb12f72f0
vendor/firmware/a420_pm4.fw|96addc1f5cb6dd3a57fc40ef0a6ba8721d5b601f
vendor/firmware/a506_zap.b00|c45a7b34456844f5deb73e2dce79cbfcfb9ae71c
vendor/firmware/a506_zap.b01|094fb7711df58a440d98dc017af7198c3c54714e
vendor/firmware/a506_zap.b02|b79957c47f0a6757ac1d721dbe06551508454634
vendor/firmware/a506_zap.elf|69e30e6f1851468be0bb1e2264c5aee51c4ab158
vendor/firmware/a506_zap.mdt|648b8438080e991280dda7d28ac8b76c107c9e51
vendor/firmware/a530v1_pfp.fw|0864291b99bed712edfcffa94be7b4595d3af306
vendor/firmware/a530v1_pm4.fw|6a82a4fb4035fa2a933c1a26b5535d7ec7c0ac4c
vendor/firmware/a530v2_seq.fw2|63b6d25594a5c1f4217d996a2b636e17a29fc840
vendor/firmware/a530v3_gpmu.fw2|0a2f6f450231673d75ba39e5d28776db3becf810
vendor/firmware/a530v3_seq.fw2|8963a53acc689725dee4b22881a4dd4b80e5def8
vendor/firmware/a530_gpmu.fw2|706da8d5ee565dcf456341f805ee75a40773f65a
vendor/firmware/a530_pfp.fw|448f9db8271fefb08348cbc50409e8e95bd93f78
vendor/firmware/a530_pm4.fw|5741a28752355b478d455635bab008028ff7e1c6
vendor/firmware/a540_gpmu.fw2|3530f10b4825a3b08c79e0bcfaf6471ec8422f24
vendor/firmware/leia_pfp_470.fw|46a8ce821d218359ff7e846db5dcc15b31bdd5ca
vendor/firmware/leia_pm4_470.fw|99364b0afd94e496ccc833ca0424dd6853b971d5

# GPS - from FP3:11-8901.4.A.001
vendor/bin/loc_launcher|923d85bd727fb809b43fa86adbf739dd2b55285c
vendor/bin/lowi-server|5d18cc8854549c366f63cdce29178eb48c9b24b0
vendor/bin/slim_daemon|5245a3b3d48f025fae5247f8a019d58ae5dc4b63
vendor/bin/xtra-daemon|0d15669c226784e4033ddee6cf396c39ff3d2bdf
vendor/bin/xtwifi-client|7e5cb0670b20c12fbc5cbf4fb642efdd72e92f46
vendor/bin/xtwifi-inet-agent|73eb9393ba634d805055eea3fbea64785063be4b
vendor/etc/izat.conf|661b962a30295bc429ba4e97147a447fdb522876
vendor/etc/lowi.conf|980af97911c7c8b130339c6f1019a6d84f94fdd5
vendor/etc/sap.conf|b5ea86d9d9ee36dc13194474d343dae36f6fa032
vendor/etc/xtwifi.conf|ac2189707c0016c31846ccec73e8857d7f566605
-vendor/etc/vintf/manifest/vendor.qti.gnss@4.0-service.xml|6514b13f55abc0acc28e004c35ff93fb972d61a9
vendor/lib64/hw/vendor.qti.gnss@4.0-impl.so|3faeada4db08a081852d06bacda693ab2fb4678b
vendor/lib64/libcdfw.so|543b8282f4b6719113f04e14dd908137521e2bb5
vendor/lib64/libcdfw_remote_api.so|558636f4fa4c17f29cb644c8c6e07766b7240005
vendor/lib64/libdataitems.so|392953954f2fb59ce4a2e8acc11c4188e418fee2
vendor/lib64/libgdtap.so|b46b7f6caaf2c2d4f43ed263bcdff3edfdc9f0f1
vendor/lib64/libizat_client_api.so|331cc111b7ca79f110147fb49e935fcd745b02e8
vendor/lib64/libizat_core.so|dc3e14f4203d1146ea5fed09b47a2cbb70f12bdc
vendor/lib64/liblbs_core.so|447d28e3b08355282b53c01b2431cdda3b480c40
vendor/lib64/libloc_api_v02.so|b58a91ab6775bbffad7154fe5c3445d310a951ac
vendor/lib64/libloc_socket.so|3aed3ebfa35ab1ed8a1ce6b63391000878e59372
vendor/lib64/liblocationservice.so|caeb98959d02a3bd8fc90ede67139a3aafde90b3
vendor/lib64/liblocationservice_glue.so|86bad6c355db3d89e24569bad4b7e2c04b89d778
vendor/lib64/liblowi_client.so|f6f99b941b4e63799576ab0cebd237e917807881
vendor/lib64/liblowi_wifihal.so|ff3a6c552601fd8dcf02e5a5e84a74b4c44ff87e
vendor/lib64/libqcc_file_agent.so|cd70ce305d5036a027060aa989b0dcbcfab8edb6
vendor/lib64/libslimclient.so|47d06cc88b0450889e5ac07038965566d7152f10
vendor/lib64/libxtadapter.so|495af82c252ccca8257c5281ba699da214fd1539
vendor/lib64/vendor.qti.gnss@1.0.so|7b9184263c7494c91f5811f7de91eef365034cf6
vendor/lib64/vendor.qti.gnss@1.1.so|4aff58f45ccd00aacce8480d8892a5941bf04a0f
vendor/lib64/vendor.qti.gnss@1.2.so|7561202e43cddc8419465e6d33a4756111e6ce5c
vendor/lib64/vendor.qti.gnss@2.0.so|2e425157e11738a9ae0c951f7e17f689f6afaa55
vendor/lib64/vendor.qti.gnss@2.1.so|148c38d7bb7f604637ff38d25aed75f412ebea3e
vendor/lib64/vendor.qti.gnss@3.0.so|511a8354bb199b1b4d0d264762bdc078fd9f3e6b
vendor/lib64/vendor.qti.gnss@4.0-service.so|218e7e15a1d3b58bb8adb695e7b37036977c5573
vendor/lib64/vendor.qti.gnss@4.0.so|7ba7853e772806f98fe60243542498a146dfe248
vendor/lib64/vendor.qti.hardware.qccsyshal@1.0.so|3ff445db2dd2db1a1068fe70a54a6c04fbdd3123

# Gatekeeper - from FP3:11-8901.4.A.001
vendor/lib/hw/gatekeeper.msm8953.so|8197aba59f6700725f63c2fda6e10c4935c55357
vendor/lib64/hw/gatekeeper.msm8953.so|d760257a98254b9e87ae258e267b1a45a0ed7ecb

# Graphics - from FP3:11-8901.4.A.001
vendor/lib/egl/eglSubDriverAndroid.so|72f727554575728006e8ac05b0ad714481259690
vendor/lib/egl/libEGL_adreno.so|b27eabcb8a90912d915f2fa3061116642e16d300
vendor/lib/egl/libGLESv1_CM_adreno.so|d7afdc835b962b30580eec884ede914a869ef9bc
vendor/lib/egl/libGLESv2_adreno.so|fddfa911dd52c69c6c7b60f553c0795138696bd8
vendor/lib/egl/libq3dtools_adreno.so|87e6c7ee189baa3f957b795ef05e95ca08276715
vendor/lib/egl/libq3dtools_esx.so|3bef07d3e0c50ca1999949b11693ec68f4829fba
vendor/lib/libC2D2.so|78a61602407f15874b23214c58faab2cb4ccf928
vendor/lib/libCB.so|d6dd4d7529d05ac102b936965be3e59d87f7d7d5
vendor/lib/libOpenCL.so|065575c14a735bff3ce30a266d8b622008b3c465
vendor/lib/libVkLayer_q3dtools.so|62207fd316b0c1cbe2e1cbee58d235e7afbf5070
vendor/lib/libadreno_utils.so|f5f51b75191c09dd8c63e420e6f68a9f9d28348a
vendor/lib/libc2d30_bltlib.so|9e25a5b0e6af79f5f97a6dad1446266d06ac6c28
vendor/lib/libgpudataproducer.so|5b64f139fe49255c74d33e4014d5d426a1064a5e
vendor/lib/libgsl.so|6377c09442221afa58e53468a203fe3ea7e5f5eb
vendor/lib/libhdr_tm.so|04d3cc1e1c0f9b85ccbee1c86c913665d2fe02f2
vendor/lib/libllvm-glnext.so|b5f653aa2c9e1ea25c30f84cf8875fa6cb3d94ee
vendor/lib/libllvm-qcom.so|6ba8089262575b17e2702917af3e85cfedf69e24
vendor/lib/libmm-hdcpmgr.so|4364ca206f8d7ffd87d6f552e4760196de62ad7b
vendor/lib/libpvr.so|2494a6cfc4ebd466565a77224cbe00cd2f4ea8da
vendor/lib64/egl/eglSubDriverAndroid.so|d6dc70f08a0e68e897c2c8a956a8c2f3e036c540
vendor/lib64/egl/libEGL_adreno.so|ca0184f73e4894a58cf1a53da9e025ddad9eb74d
vendor/lib64/egl/libGLESv1_CM_adreno.so|b45486353fceb47ec419ef580fdf6d2305a842ff
vendor/lib64/egl/libGLESv2_adreno.so|86d80c7f17b43d6f11e8731bd4fa481b2da31e0e
vendor/lib64/egl/libq3dtools_adreno.so|189b9c3d400c6a98c87582b8df0910530cba6d44
vendor/lib64/egl/libq3dtools_esx.so|40df59c64795bdc937c18e8398bdb7d96826aba3
vendor/lib64/libC2D2.so|175115cc36fd471f9eb83af76be21b5f602b9460
vendor/lib64/libCB.so|f4ee960e0169cd72082c18df22d90c2b04b47355
vendor/lib64/libOpenCL.so|d49daef4801942017b90faf2183f0643fca49ce7
vendor/lib64/libVkLayer_q3dtools.so|df2c4599240081c43dc27c5d3520e488991463a2
vendor/lib64/libadreno_utils.so|2dc4b21766ab7947fba7f1c2c9b085e6d6129775
vendor/lib64/libc2d30_bltlib.so|68dda7852c6093578b69e88ce4db10243a48e02a
vendor/lib64/libgpudataproducer.so|96a09c2b50df06531d95adf9cc6b02d15ae003a2
vendor/lib64/libgsl.so|4328c6da13f53efb538c13b5e67310bbb07e2a29
vendor/lib64/libhdr_tm.so|a1b9bbad12217e6b79951774801aa54be6460fd6
vendor/lib64/libllvm-glnext.so|8b96ab94cd535c163d0548a5802fae9af4930fb7
vendor/lib64/libllvm-qcom.so|412245fac906f38a3e6ece376615003817eaacab
vendor/lib64/libmm-hdcpmgr.so|faf9491a8b15b9ca98a71e216ed94a61eca87540
vendor/lib64/libpvr.so|c918ba2be10ed3a2f264728faa3d5d000106cb27

# Graphics (Postprocessing) - from FP3:11-8901.4.A.001
etc/permissions/com.qti.snapdragon.sdk.display.xml|79a36c560f8cdbfeca03911fefc282bda25b2322
framework/com.qti.snapdragon.sdk.display.jar|657b74d0517f6438d3e0914f92f3b8de6d2a10a1
vendor/bin/hw/vendor.display.color@1.0-service|815cc36f3722fbfb5fdd52f6678309d207888038
vendor/bin/mm-pp-dpps|c04b41c500b1bcf81cb605b3ef0b3b1d5e8320c3
vendor/etc/init/vendor.display.color@1.0-service.rc|5ad673f879b3685a0e79b5633437e5499cb94f48
vendor/lib/libdisp-aba.so|fb3073b1f4336b07498c6c7dd416de452fac9de7
vendor/lib/vendor.display.color@1.0.so|620d4a7c0a6335091afbd79a5debbbaf49cd34fb
vendor/lib/vendor.display.color@1.1.so|251e35e8e452355c5b8b9ace5a9e7a7f2d33e3bb
vendor/lib/vendor.display.color@1.2.so|c33bb9936c5c508b8ceea15822f8fbbbe999cc73
vendor/lib/vendor.display.postproc@1.0.so|634dfbf37665441a823f69209c21c0b55c4f158b
vendor/lib64/libdisp-aba.so|4d364bb0699346a1fa57b9033f28d2a25c80ec0c
vendor/lib64/vendor.display.color@1.0.so|f80b69b96c3ff6a1eb865740de95f67c67be785a
vendor/lib64/vendor.display.color@1.1.so|61e072efa368bf2795d1c8b0e9962471d60905de
vendor/lib64/vendor.display.color@1.2.so|ca979992335c75885e341e51b939afd856f5b64f
vendor/lib64/vendor.display.postproc@1.0.so|8ec8b1c4764eda08ed1154f3487ef0a8f0ad5345

# Graphics (Qdutils) - from FP3:11-8901.4.A.001
vendor/lib/vendor.qti.hardware.qdutils_disp@1.0.so|20f218332beb83ecee515c381ca20251b4b6faf1
vendor/lib64/vendor.qti.hardware.qdutils_disp@1.0.so|df63adf915d46e2f998e2495b44a8cd79267bab0

# Graphics (RenderScript) - from FP3:11-8901.4.A.001
vendor/lib/libRSDriver_adreno.so|9822b808be17d2f9683edd8936d9bdf0f2bb78be
vendor/lib/libbccQTI.so|428e8c5c5c86bce857a4c0deca2cd3797c775e2b
vendor/lib/librs_adreno.so|227edc6fa4e16599d92d3c202112c6021d354a54
vendor/lib/librs_adreno_sha1.so|8ba215e033ff4ed1049ae0418b897a97b7ca9cf6
vendor/lib64/libRSDriver_adreno.so|dbeb4122053e468b8fe52496f8c93261945ffe99
vendor/lib64/libbccQTI.so|42fdea81ea505ccadbf6d24af7ba37cf83760391
vendor/lib64/librs_adreno.so|bf87696c917d75da5557c194098faaae5e303a0b
vendor/lib64/librs_adreno_sha1.so|19ce2db0e1a10f2d4067eb1192351e3dbf429477

# Graphics (SDM) - from FP3:11-8901.4.A.001
vendor/lib/libscalar.so|c78e4b32170501fd85daa8804aaa54afbcb40dd2
vendor/lib/libsdm-color.so|6384a5eef8062889cf9e34e6eea0026fbfca44e9
vendor/lib/libsdm-diag.so|62e295e92a09eb07ee77966c775ef1b136198a5e
vendor/lib/libsdm-disp-apis.so|39d52eb5e311950a6b8eca35ac53758e7297e9cf
vendor/lib/libsdm-disp-vndapis.so|7bc8ae0bb731344312358edca4559a215dfa0f06
vendor/lib/libsdmextension.so|34972380240e8448ede4c24dc702ea76e97d4cef
vendor/lib/libtinyxml2_1.so|7410663300606be35e233783fb2c4969f66c9c0e
vendor/lib64/libscalar.so|fb38a16b3c082a8cb861905c32dff71187dca2b7
vendor/lib64/libsdm-color.so|d9bec7004ec8fd292bb0cd3388359448ca96bd23
vendor/lib64/libsdm-diag.so|b6b6f2b602c2b19763d262a021ce6ee5562d7dc6
vendor/lib64/libsdm-disp-apis.so|752de98fed59c7d161a113b62d46e20a2c939789
vendor/lib64/libsdm-disp-vndapis.so|8e92d1f17735c26658c17148da6e1882b5bc6fb0
vendor/lib64/libsdmextension.so|4428ff01496cc0c07f623fb813eb8e0047df1ecc
vendor/lib64/libtinyxml2_1.so|ff32deb110acb02cb5def5f3404f9064c1276483

# Graphics (vulkan) - from FP3:11-8901.4.A.001
vendor/lib/hw/vulkan.adreno.so|d8605174a447fe05976ed195318797f73a943ed5
vendor/lib64/hw/vulkan.adreno.so|242ba0af54ad1467998c8df1345b85d568889a4a

# IRQ balance - from FP3:11-8901.4.A.001
vendor/bin/msm_irqbalance|b075c2f4092c175950a2c26d19bf2013e2efd6d5

# Keystore - from FP3:11-8901.4.A.001
vendor/lib/hw/keystore.msm8953.so|1576284951387ada5f6d3a4e0689d2579c0f1713
vendor/lib64/hw/keystore.msm8953.so|83a48633d4530c45e36cfb9cd7f3d63a8a5bc122

# Listen - from FP3:11-8901.4.A.001
vendor/lib/libadpcmdec.so|452d1123ab4e12c4444df33322f309e2ecc2e1e4
vendor/lib/libsmwrapper.so|1376bf567a0a225d1ac8c623db4ace9a7e3804f7

# Media - from FP3-REL-6.A.020.0-gms-88126537-user
lib/libFileMux.so|22005fb1595b2b76e199b82ff3790c1bc3d54a20
lib/libOmxMux.so|e444f3b38f7d2469ff3965243f93180f8fc18329
system_ext/lib/extractors/libmmparserextractor.so|2e4430f1fffdf458ca48f9b27b54edfa50e3bd65
system_ext/lib/libavenhancements.so|9372b77cbd6667a2144c55da1adf3859ae37f849
system_ext/lib/libmmosal.so|1e32cc6c1d78ec7d6aa77499dd4c1601b2e52a94
system_ext/lib/libmmparser_lite.so|1662216531f8e5d298505d6bb6fb49c706df2c30
system_ext/lib64/libavenhancements.so|884d8585fe7554ee332e6436241a82f27a098890
system_ext/lib64/libmmosal.so|2a59fead77df59d9b2c3bec3db4fc0594d0abd73
vendor/etc/seccomp_policy/mediacodec.policy|3dec19ed56099a36b44cc72ad04ab23b9cc22ace
vendor/lib/libFlacSwDec.so|cf635f2627fb277fce39d34d77986bc29ed56f43
vendor/lib/libOmxAacDec.so|ce6447b7138f0e0cf365d97668a5ded072683234
vendor/lib/libOmxAlacDec.so|5b1e5015b6408866f20d352244524c48e0ce17cf
vendor/lib/libOmxAlacDecSw.so|407e1d197753140f686dbcb95ab191b21b38bcff
vendor/lib/libOmxAmrDec.so|78ad175f009fe3fe3e316c9469184142ae813b24
vendor/lib/libOmxAmrwbplusDec.so|087c71ccc858e4e5d048f5150c39b7f3619ccf02
vendor/lib/libOmxApeDec.so|85bb0aa592b11111de73063d850c4afa4c9f00cd
vendor/lib/libOmxApeDecSw.so|c36f7253818ee759988ba430896590fec4f0c570
vendor/lib/libOmxDsdDec.so|e669191874ef80c9569f06b9827e8c4c1fc2f977
vendor/lib/libOmxEvrcDec.so|3f58234a838bed1360ba80c2fe09c05173b1e623
vendor/lib/libOmxG711Dec.so|e95941e80d00bf94944868750e1c55ef2aa601ba
vendor/lib/libOmxQcelp13Dec.so|49291073551d311fde33f76eed6b420615bee382
vendor/lib/libOmxVideoDSMode.so|58c76ededad030bf9fc89afd47eab863ddb184fb
vendor/lib/libOmxVpp.so|76daeaf7b83dec5f55f2dc194cc8c47ead7ce511
vendor/lib/libOmxWmaDec.so|f93ed022df05fbf6b7cbda0bd88eebfac47f47da
vendor/lib/libmmosal.so|28d324f37d535d53916cb894caf3bb037bbf146d
vendor/lib/libvpplibrary.so|13c6073c9a84b5508cd2612e41a9d0336135afed
vendor/lib/libvqzip.so|c56eaffef2066339493fa6810930e58556891027
vendor/lib64/libmmosal.so|d400435a7bb49c1589efd0a63274cbf6d53f0c7b
vendor/lib64/libvpplibrary.so|89b49c112864bf0d33c07c78fb7750d4bd7eb663

# Peripheral - from FP3-REL-6.A.020.0-gms-88126537-user
vendor/bin/pm-proxy|910437c11108aa66e803bbc760ce3998d141a6b4
vendor/bin/pm-service|98827a6bf6693033a7c767e3fb4f097b9075a0ef
vendor/lib/libperipheral_client.so|7ace2f7c8c7ebd986db6c7796de7237e584e658b
vendor/lib64/libperipheral_client.so|9bfd41e276e16b8f7c6808f3d87531fc5be4cdd5

# Power-off alarm - from FP3-REL-6.A.020.0-gms-88126537-user
-product/app/PowerOffAlarm/PowerOffAlarm.apk|426c18285909031b9c4525baf4e511ebeb74afb7
vendor/bin/hw/vendor.qti.hardware.alarm@1.0-service|e8f29b90facd4d605dca41644f5a0dc77f6d2e9b
vendor/bin/power_off_alarm|b41ffb912ae8db9c3abd7e3c94e9e77160cf7ff6
vendor/etc/init/vendor.qti.hardware.alarm@1.0-service.rc|a03a9a1c818595b19272ea6ffb466e23a7fc3b05
vendor/lib64/hw/vendor.qti.hardware.alarm@1.0-impl.so|fdc8542c93c3e0572a172040bb6bb741baba348e
vendor/lib64/vendor.qti.hardware.alarm@1.0.so|f34f3f363932160ef659ec21543b0d33f0215dbc

# QMI - from FP3-REL-6.A.020.0-gms-88126537-user
system_ext/etc/permissions/qti_libpermissions.xml|593bcb72cce68ceb0a70f50bcae7d460114e7c62
system_ext/etc/permissions/qti_permissions.xml|e6ff4572352b1a4f91b6b9d7cbb1cad9924410a0
system_ext/lib/libqmi_cci_system.so|bf7eb027f126beeaac840218e9cd29baf92a1879
system_ext/lib64/libqmi_cci_system.so|d5d1800079d6f5b88748732c5df3170f2e53167d
vendor/bin/irsc_util|e590882aefe9da28c1d57e9bf46962198f1dabcd
vendor/lib/libdsutils.so|60135d6d64ecba72fa0eb637a434578290beaaff
vendor/lib/libidl.so|dc8d161c035f70e7e6c55461b0238fbe916c5a7d
vendor/lib/libmdmdetect.so|a2df5e8eba8bd275de62bbb7c0f6af1c78fbc7a0
vendor/lib/libminkdescriptor.so|a97a85de774b0d6c4537316b960252dd2ebe859f
vendor/lib/libqcci_legacy.so|fa7f0fe72c0246633d842891bb0187867930f63b
vendor/lib/libqdi.so|6fbd9d89b27a7f54925a6a174b75dfaab450c59b
vendor/lib/libqdp.so|9d9058f4761990d09acd5610e281a5cee4bd5e95
vendor/lib/libqmi.so|08e30ffe119992357de2e8f02b2cd3ea1fed6a50
vendor/lib/libqmi_cci.so|6b8aae60c097ef8ae18f2497ed803bfdbab4e252
vendor/lib/libqmi_client_helper.so|8e8184cccc95e0d8b3b95677e69332d5453ac773
vendor/lib/libqmi_client_qmux.so|c2d7ec0886ff49d14f0b93fd91edb77130311fe4
vendor/lib/libqmi_common_so.so|487dab3792cd55351cdaf0a0d0e5fb974860f992
vendor/lib/libqmi_csi.so|90930481c581a6b319bd87b6799b8e0ee882e52c
vendor/lib/libqmi_encdec.so|e45cfc088efc2141047d304c9577f466bdb5dfbc
vendor/lib/libqmiservices.so|52244e9d54c4d352d148d276044a4b7cc4c78bf4
vendor/lib64/libdsutils.so|0b466344eb6628feb1b5aba00d1ef3f680e5aa9a
vendor/lib64/libidl.so|79ebe1a5b1fb81d9cdc972c71cec2667cdcf6599
vendor/lib64/libmdmdetect.so|1acafe6bd37e770d97649b703d2b695d790d2191
vendor/lib64/libminkdescriptor.so|b63dc4f26964f5a78c5b34415da902e46a70245e
vendor/lib64/libminksocket.so|103f45603bef0d1fbf52ccdf8458dd31cabe3945
vendor/lib64/libqcci_legacy.so|d4643c6a585a62d9249acc841a4137c097299e4c
vendor/lib64/libqdi.so|c9e0b315edfb6a8f6e6afb5370e9dff5e934c78c
vendor/lib64/libqdp.so|f83527aa6b6aa45c6495056dc830affbe889fb18
vendor/lib64/libqmi.so|e29aa40904a3b1cf73dd739861154acbbe73ecb3
vendor/lib64/libqmi_cci.so|821c9ed22945e020e8f855267d53be5f2b619740
vendor/lib64/libqmi_client_helper.so|b53191b0ff5bd9abadd3751ef2896ef13e9cd8d2
vendor/lib64/libqmi_client_qmux.so|600fe6c17ae7a5ca01d02bcbbbf7fb2c0510bd41
vendor/lib64/libqmi_common_so.so|4a162382e0d611dacbb803371e78eb56786078b9
vendor/lib64/libqmi_csi.so|6d22ed6353c791ea1804c195b92b02dc28a679c3
vendor/lib64/libqmi_encdec.so|8a365cf7472c187c02fa0649e09fee529ded7563
vendor/lib64/libqmi_legacy.so|5dc657620cfaa6b13bd37268459c7247bae58770
vendor/lib64/libqmiservices.so|2e259463cbeb329caec303b642ab4068c8d10be5

# QMI (diag) - from FP3-REL-6.A.020.0-gms-88126537-user
system_ext/lib/libdiag_system.so|b46c6f0afefeb720fb0ba65add939f4961de6ddf
system_ext/lib64/libdiag_system.so|ead4f1d1065abca6ef47b522c1934eb7623c1813
system_ext/lib64/vendor.qti.diaghal@1.0.so|dcc31fc969e846ea58ec91a37c1f1e77b49e731e
vendor/lib/libdiag.so|0a9a6aa74b1728bfb9c6b3ccd7cf0a5bdbc29434
vendor/lib64/libdiag.so|174ff3f940288d2d1503230465dfe917ab9d155b

# Radio - from FP3-REL-6.A.020.0-gms-88126537-user
-system_ext/app/QtiTelephonyService/QtiTelephonyService.apk|990a125d2581cfaa7b8bab56580a00cdadd53481
-system_ext/app/embms/embms.apk|99dd78949c7903cd35f92552f2434e9e12fcd3f3
-system_ext/priv-app/qcrilmsgtunnel/qcrilmsgtunnel.apk|a1257d061330d5fb975e455cfe3a2ba6cc89790b
system_ext/etc/permissions/embms.xml|22e7474091f9f71f02dd0cfc76cfa8848a46f079
system_ext/etc/permissions/qcrilhook.xml|30397e293b2c40e6b7a1d11c2a615cdd05de625a
system_ext/etc/permissions/telephony_system-ext_privapp-permissions-qti.xml|4f0056403f56928b8c75a617ba582f17061f89ae
system_ext/etc/permissions/telephonyservice.xml|b7831598d3c19c6ce4ef431d1cc44d94c3c35a8d
system_ext/framework/embmslibrary.jar|b5fe26c1cea597af8a1751332d187f2f574816c1
system_ext/framework/qcrilhook.jar|2851c62bf5d823c4228bfc6c56613934517ffdee
vendor/bin/adpl|c6e56a34827222135596c7266343187e055bda06
vendor/bin/hw/qcrild|9ebae4b7b4bc8fb31371f3926634206737d73bb2
vendor/bin/netmgrd|f3eafb4d5e31e3f90544f380667625dfdc22aa37
vendor/bin/port-bridge|aeff25bb226f44e45ed062e0525651804f261c21
vendor/bin/qrtr-cfg|24385c1df959d914aee005e607ad89ef5b5b28e0
vendor/bin/qrtr-lookup|196863b08aa01b1f19632ac2687245e83002c98d
vendor/bin/qrtr-ns|f34e89ba7d2ed5c0fe623a681bfc9b6b742cb3c1
vendor/bin/qti|b77e71520fa5439dc0bf828a8b9ad4f52ce87d49
vendor/bin/rmt_storage|71e31a6b00bc140c0a7a7f9b999a6aa857983244
vendor/bin/tftp_server|36bc4fa70a1ee88e1920ba1051d81419d4a60d76
vendor/etc/data/dsi_config.xml|27a9616809d2e2355640d5e7cdb7268eba9f6a0d
vendor/etc/data/netmgr_config.xml|b87b057d87139c7ac866dc5f75c498de1e8ab361
vendor/etc/init/dataadpl.rc|cd4907d9bfd438fe5f5c86f5d6cec590ac0bac2a
vendor/etc/init/dataqti.rc|6abfd1a850d782adbbb6f42c9d8ca870036b2ad1
vendor/etc/init/netmgrd.rc|5c592bd2cf775462e147d3def97e99abbac4631e
vendor/etc/init/port-bridge.rc|e52d61a0de5e8a3b21bfbfca929e862422645377
vendor/etc/init/qcrild.rc|17cf4934bf443cf6469d8b3ff622eeb0e4a0aac6
vendor/etc/init/vendor.qti.rmt_storage.rc|bc212c6353c2ded44ae4d759605fbbe55aa4fa3f
vendor/etc/init/vendor.qti.tftp.rc|b27f188cbffba470a4510d50e46ff7c8446c22cb
vendor/lib64/libconfigdb.so|6634f23eebd1156c9053b5a77163ee7a058a1916
vendor/lib64/libdsi_netctrl.so|b622c0ff82676d5e02fb92445c6a030742f0c6c4
vendor/lib64/liblqe.so|02191d7bfeca08ec8b89550a27bef02c3291609e
vendor/lib64/libnetmgr.so|8d0a3e85a1d535efa22634621c4e4796aea1d642
vendor/lib64/libnetmgr_common.so|a414ca9603bddd34f1b00d648094782095f98e97
vendor/lib64/libnetmgr_nr_fusion.so|e40531a6e11af9d4905179ef6174299da99041ca
vendor/lib64/libnetmgr_rmnet_ext.so|4d3eff79502cffad09057faafffb449917031f96
vendor/lib64/libnlnetmgr.so|8f6aba985f05c837868f7e1f32b6b2399de428f2
vendor/lib64/liboemaids_vendor.so|f70e17a2f157baaeb293250821c45850169000af
vendor/lib64/libpdmapper.so|859a6acc25bf64a0503f333e960bf99d322f9f7e
vendor/lib64/libpdnotifier.so|ceb89e9fd7ded653655249ac68ccdbb238f6bedf
vendor/lib64/libqcmaputils.so|62530da64451f1386630084dc4bd08dd1d7c266e
vendor/lib64/libqcrilFramework.so|64386a08a3d8c85cd2117575e7d863a24a8b8850
vendor/lib64/libqcrildatactl.so|b3dccb609cfdc64b7bc74d9d3204904d8972df4d
vendor/lib64/libqrtr.so|2e4d6aa5344159c36ccd34cc341ee29d6f0424a1
vendor/lib64/libqsocket.so|0817c4699f08d2595971f8103776a369bd15580d
vendor/lib64/libril-qc-hal-qmi.so|cc70a2e8e2435dee4cb396dadbcd7c4c244287bd
vendor/lib64/libril-qc-logger.so|7f80da37d120faffd72838b76d74102c7321e3a3
vendor/lib64/libril-qc-ltedirectdisc.so|75e95bf6521f7840890caa1ddb003c6391ae2c6f
vendor/lib64/libril-qc-qmi-1.so|2d5ac8c1ee721081d2ae78b431aa9eb3b6297638
vendor/lib64/libril-qc-radioconfig.so|907c3208a63e4525015cc86940d8b70bc303d999
vendor/lib64/libril-qcril-hook-oem.so|e1a2e172b9800b93c8835de783440d56b5ccad70
vendor/lib64/librilqmiservices.so|e2714b4ca1792ea210899250414682c58e066f7d
vendor/lib64/libsettings.so|e83d93aa0bf78ae4887d78cb766ede5a9cf8b75f
vendor/lib64/libsystem_health_mon.so|d40c48c91ea120583316efea358cb400a23c81cf
vendor/lib64/qcrild_librilutils.so|0644fb4cfdd39557115ada179a76aab0aa0f1d89
vendor/lib64/qtibus.so|0b387ecd1b898f3d3aee6c51783817767a6d1e70
vendor/lib64/qtimutex.so|fc156f485519be1cd683f1af3ebb6194ce4ba2d5
vendor/lib64/vendor.qti.hardware.radio.am@1.0.so|4cc14bfabf63aa20f02ad069933bdf09651aa86e
vendor/lib64/vendor.qti.hardware.radio.internal.deviceinfo@1.0.so|33c17b96df825d02aa31ca6bd42a91547a741619
vendor/lib64/vendor.qti.hardware.radio.lpa@1.0.so|0895d68405d960b54a11e21ac1d5d06444324f0e
vendor/lib64/vendor.qti.hardware.radio.lpa@1.1.so|a5f2a41df2aedcd97a77a3e4ec546f36879ece3b
vendor/lib64/vendor.qti.hardware.radio.qcrilhook@1.0.so|568438dd1d703169d02c3fdb1b37e2e0cb63b6a1
vendor/lib64/vendor.qti.hardware.radio.qtiradio@1.0.so|44036cc1663f58ecfe9149311245ffdfc002ecd5
vendor/lib64/vendor.qti.hardware.radio.qtiradio@2.0.so|b7eb75b7b8b9596706eaa60615c35db267877067
vendor/lib64/vendor.qti.hardware.radio.qtiradio@2.1.so|83e3b2bd7a74ade550adcd64292048c8e8bb257b
vendor/lib64/vendor.qti.hardware.radio.qtiradio@2.2.so|578c82624565b784b8417caa282bdd8600ee3cfd
vendor/lib64/vendor.qti.hardware.radio.qtiradio@2.3.so|f2f651485fc35db21582a1e552d74126794bfabd
vendor/lib64/vendor.qti.hardware.radio.qtiradio@2.4.so|2b3b80ab396bb4ad94a175ff36d10ee27b9b263d
vendor/lib64/vendor.qti.hardware.radio.uim@1.0.so|e319529414aea26f0b80926c67fb76e15133fbfd
vendor/lib64/vendor.qti.hardware.radio.uim@1.1.so|dcb22ced0787401f068eae9522aa5a8d6c0ce911
vendor/lib64/vendor.qti.hardware.radio.uim@1.2.so|b5b51274af9ae10e912cc240de97aa0875547e70
vendor/lib64/vendor.qti.hardware.radio.uim_remote_client@1.0.so|aa75f275e76d978b8b8a335f9cf782d4b41b58c9
vendor/lib64/vendor.qti.hardware.radio.uim_remote_client@1.1.so|f79ccf1975eb72fe4d4d9404e53614286041da3b
vendor/lib64/vendor.qti.hardware.radio.uim_remote_client@1.2.so|bb5517ea122c87762689a2036a2ecf1a30bc86f2
vendor/lib64/vendor.qti.hardware.radio.uim_remote_server@1.0.so|ec2ac641577d5ef350badc90b7f73ea91c399d1c
vendor/lib64/vendor.qti.ims.rcsconfig@1.1.so|b2faf304adadcdd84b0dafeda6d4d56821517727
vendor/radio/qcril_database/qcril.db|f51df17ac3bf25a225e3ba15c830b1d0d2bf4e85
vendor/radio/qcril_database/upgrade/0_initial.sql|e00b243261d8941802bdea9d4e659dc5e927c216
vendor/radio/qcril_database/upgrade/1_version_intro.sql|67b96cb3e94737bfe271b2519b9eb5fae17373a2
vendor/radio/qcril_database/upgrade/2_version_add_wps_config.sql|b4a825ba20fea3e2f20c7f02c8bd64596c24a75e
vendor/radio/qcril_database/upgrade/3_version_update_wps_config.sql|0571aacaf9fc0868c48bba2f7542f5b4e68c9022
vendor/radio/qcril_database/upgrade/4_version_update_ecc_table.sql|0734c6a2863edadc7a8422b8310d267c594d11a0
vendor/radio/qcril_database/upgrade/5_version_update_ecc_table.sql|fcb2cba3bfd718ecdc8d3cfac3a0b2b2c7e8c506
vendor/radio/qcril_database/upgrade/6_version_update_ecc_table.sql|0fdf4b6ccb48906b37885e060429f79c9fd6bdbf
vendor/radio/qcril_database/upgrade/7_version_update_ecc_table.sql|9a76d5747da2876b87b214579c9d74ae92d218d7

# Radio-IMS - from FP3-REL-6.A.020.0-gms-88126537-user
-system_ext/priv-app/ims/ims.apk|482ca5179a0b29a8d2a847d67408c4376f4a5b89
system_ext/etc/permissions/com.qualcomm.qti.imscmservice-V2.0-java.xml|bd9fc166b542b4e730f194ebc996957770d9d497
system_ext/etc/permissions/com.qualcomm.qti.imscmservice-V2.1-java.xml|b40fc74f7d5e58b4e918f952b89a79cf2a5c4088
system_ext/etc/permissions/com.qualcomm.qti.imscmservice-V2.2-java.xml|bfceff47fb0b55a418bed71de6050d876a776ac7
system_ext/etc/permissions/com.qualcomm.qti.imscmservice.xml|db25ef24f1937366d58a53b4f4b8923bc9e98d2d
system_ext/framework/com.qualcomm.qti.imscmservice-V2.0-java.jar|bc9bce9bcc7250bfba907db6a16b74a92bcb8e38
system_ext/framework/com.qualcomm.qti.imscmservice-V2.1-java.jar|13df5f82893912b9c040fa72ff2ca97ebc6023b6
system_ext/framework/com.qualcomm.qti.imscmservice-V2.2-java.jar|b95b2b4dccd365ae7b09b8982b61184fe82630f7
system_ext/framework/com.qualcomm.qti.uceservice-V2.0-java.jar|e373bf8dddb0a7b79e36653c22637666cef296be
system_ext/framework/com.qualcomm.qti.uceservice-V2.1-java.jar|7a073d87c95fb3c65fd5a9b1454d20b38f8e258f
system_ext/framework/com.qualcomm.qti.uceservice-V2.2-java.jar|275b1cd69af00c3668376359f73b28b41ca0a473
system_ext/framework/vendor.qti.ims.callcapability-V1.0-java.jar|3cdfb07c3f33bf6ea1cfac52bd125f959995872a
system_ext/framework/vendor.qti.ims.callinfo-V1.0-java.jar|3993d8d98969d0eaa7b5676128e85718588677d0
system_ext/framework/vendor.qti.ims.factory-V1.0-java.jar|cd039a9c8d919332d57f9945a92ccac21f20d6c5
system_ext/framework/vendor.qti.ims.factory-V1.1-java.jar|ab9114d0a99a7155d625ff04bf8d20a03fdfc10f
system_ext/framework/vendor.qti.ims.rcsconfig-V1.0-java.jar|abbfa2c4003a0b6e4906225c623c7d001ed6258a
system_ext/framework/vendor.qti.ims.rcsconfig-V1.1-java.jar|f0348553c3c777d53725d6d4d55fa9c218d8ee49
system_ext/framework/vendor.qti.ims.rcsconfig-V2.0-java.jar|dc0be9b3621fdaa8eaf8d4fad5c8d2365c9beef8
system_ext/framework/vendor.qti.ims.rcsconfig-V2.1-java.jar|af9770ca830ad0228890254ae0d735993e0af22c
system_ext/lib64/com.qualcomm.qti.imscmservice@1.0.so|128788c0d72a038f7ffb83fa54d3dd424044f58f
system_ext/lib64/com.qualcomm.qti.imscmservice@2.0.so|513cdac21c72a069039e02c2b8cb6bc15dc1bf67
system_ext/lib64/com.qualcomm.qti.imscmservice@2.1.so|5ff5ef2bfcc39262033268fff78e8ff52839499d
system_ext/lib64/com.qualcomm.qti.imscmservice@2.2.so|bf06ca52c41ea874ef31004f67f5b2351366f32b
system_ext/lib64/com.qualcomm.qti.uceservice@2.0.so|ba875bc00dc4a7a08365ad7149e5b0c36ce9dcd7
system_ext/lib64/com.qualcomm.qti.uceservice@2.1.so|c6354e16b958c1b3cb4a59acb3be861c7a81bbbb
system_ext/lib64/com.qualcomm.qti.uceservice@2.2.so|3dac05fad6a4ba527a33045364519a035f9d8b5f
system_ext/lib64/com.qualcomm.qti.uceservice@2.3.so|00ba5cd4acb1e1009cac039be628bfb5dd5bcf7d
system_ext/lib64/lib-imscamera.so|8170256dbf9120ff05f193ba937c718d9c580881
system_ext/lib64/lib-imsvideocodec.so|3e364441c9dce63d74fbc78c4781a84080513d8a
system_ext/lib64/lib-imsvt.so|4f96cc5f27551d0b6cb11ad6447d9ce8829dde47
system_ext/lib64/lib-imsvtextutils.so|1acf1de305e455a3a924483e5652b37133d10fd1
system_ext/lib64/lib-imsvtutils.so|dfc5cf0854fe38c191a53ec3bd2a322d05d85567
system_ext/lib64/libimscamera_jni.so|114876ec8ba85965a69694a7edc0e555fe099061
system_ext/lib64/libimsmedia_jni.so|b90664b4ce069358f36801da5ceac10baf4ebcc6
system_ext/lib64/vendor.qti.ims.callcapability@1.0.so|29a5f606fd876042d50357ab0d5fbc9df907b177
system_ext/lib64/vendor.qti.ims.callinfo@1.0.so|87b7b16b854f2f47706d974f2d3f138e140a4325
system_ext/lib64/vendor.qti.ims.factory@1.0.so|1421a7d0390c9ecd71c60fac026ca3499dddd913
system_ext/lib64/vendor.qti.ims.factory@1.1.so|c6c1813b2c6bb68c8c38a6b5ddf320b418bc0da9
system_ext/lib64/vendor.qti.ims.rcsconfig@1.0.so|d87ff622aa4a933501ed605622af4b61ddf426da
system_ext/lib64/vendor.qti.ims.rcsconfig@1.1.so|83e4dd760b63c14cad4d4fb26fd6c96d7083bbbc
system_ext/lib64/vendor.qti.ims.rcsconfig@2.0.so|4344e1727e31eeb4edbb9a1e3d4e42a4afdb978f
system_ext/lib64/vendor.qti.ims.rcsconfig@2.1.so|37c2b6333ce0fbeb8e2a66b668b68222ab0ba9d8
system_ext/lib64/vendor.qti.imsrtpservice@3.0.so|4cf9e97f526c6278c5e2136e00d1fb800fb941aa
vendor/bin/ims_rtp_daemon|32a3ce381b0f85f53a2e9afd7215b3585afef0d6
vendor/bin/imsdatadaemon|3f044f84eb4049f1ce8a26af6a6026c1776d22dd
vendor/bin/imsqmidaemon|756dcc2d6c7fa26916bc28dedf0c513b1d5e5bfe
vendor/bin/imsrcsd|bf29aac14856f29268c01599e5f6c7c6ae520685
vendor/etc/init/ims_rtp_daemon_legacy.rc|104b2a879db4d3dd44e74a3d7f6e69f6972c9129
vendor/etc/init/imsdatadaemon.rc|29face37c174aebcd1358f7d7ad0bd4baf83063b
vendor/etc/init/imsqmidaemon.rc|dda16d842b7c65296e97bc9921b723a43b152ba3
vendor/etc/init/imsrcsd.rc|2dc42ff6e4b6dd389bd3bc9a7af30dec2f1a45df
vendor/etc/seccomp_policy/imsrtp.policy|7ea8b4012da7bde98fc91bd882185b32784793cc
vendor/lib64/com.qualcomm.qti.imscmservice@1.0.so|6d39c1bb92cd03df1f71315fca6995ee8a1d0cd4
vendor/lib64/com.qualcomm.qti.imscmservice@2.0.so|fa5fe282dc9a6953ba4586415cdf161ed5a040cd
vendor/lib64/com.qualcomm.qti.imscmservice@2.1.so|a541d0198e914ae6afd2cc051de55894d23bb8b0
vendor/lib64/com.qualcomm.qti.imscmservice@2.2.so|3c760d54508c404a802294da677db6077fe10170
vendor/lib64/com.qualcomm.qti.uceservice@2.0.so|333c782d6cc5961e44a4d128d838f543acec65cb
vendor/lib64/com.qualcomm.qti.uceservice@2.1.so|d8ae76c62bf03be478f059911f3cd06a2bd987df
vendor/lib64/com.qualcomm.qti.uceservice@2.2.so|bd8b1c93c7feb6ce62d2cb8f41d203e0537b555d
vendor/lib64/com.qualcomm.qti.uceservice@2.3.so|597dbdf8bb12602c141da99b50ab1d5d838adc7e
vendor/lib64/lib-imsSDP.so|4d19d270ea4ecde57d3fe2c5435379558ca94a52
vendor/lib64/lib-imscmservice.so|1256a36db63ed10e3f7f6c659d5086bf1ed8752f
vendor/lib64/lib-imsdpl.so|18c2071b74fc8dfefeabf0c2e075720ebaa81ab2
vendor/lib64/lib-imsqimf.so|d0813dc6a1360c31bc2736b6d59d2fa3a0c614f8
vendor/lib64/lib-imsrcs-v2.so|3937e675ce460f3950e04aef67b1d17e7fd227a5
vendor/lib64/lib-imsrcsbaseimpl.so|8b765d37ac42cb813cf28995fb1359f42f26912f
vendor/lib64/lib-imsvtcore.so|c3354efe3909f2971a0a4f847c4dddca02bdb81b
vendor/lib64/lib-imsxml.so|25d01eaf4d9a1a0d5002e8ad27500d19b9adbbe5
vendor/lib64/lib-rcsconfig.so|0b92e7427537686f9e63b9b68e06eb15ffaf48a5
vendor/lib64/lib-rtpcommon.so|8c1c8d87c1686bf972035460c588cc75b26e82c6
vendor/lib64/lib-rtpcore.so|94e6989c19b2f7813fa8996822430a6813cdaf1d
vendor/lib64/lib-rtpsl.so|44c91df047d3ae8dfc8b747e7fdd1c48d4e48dc0
vendor/lib64/lib-siputility.so|d478b100a73911120e3cb92474aa0f143e5345a9
vendor/lib64/lib-uceservice.so|c7af1b597aa7d62d4a710ac8b012207e2a749bfc
vendor/lib64/librcc.so|e35056f3b5c0790d65ded14ed48dd1ed1296ecc7
vendor/lib64/vendor.qti.hardware.radio.ims@1.0.so|c733d10f069f76d2f29e9719d0c50125a6acf230
vendor/lib64/vendor.qti.hardware.radio.ims@1.1.so|67f1a71c8c4a4340bf644c9e3fc368962b519368
vendor/lib64/vendor.qti.hardware.radio.ims@1.2.so|1967c6e57583e8061291437fe13f16d3a84ae7b0
vendor/lib64/vendor.qti.hardware.radio.ims@1.3.so|b712468fdc7fc841db469dca211fd0e97dd0bdba
vendor/lib64/vendor.qti.hardware.radio.ims@1.4.so|0518f96fd40a1638d6c6a1e61ff4d5f0fd5154b3
vendor/lib64/vendor.qti.hardware.radio.ims@1.5.so|460892bc063163bef3d6a1a348dab22ec70d5e37
vendor/lib64/vendor.qti.hardware.radio.ims@1.6.so|2d6fc4dab39c4d332984e8b940bd16b66f3b56ef
vendor/lib64/vendor.qti.hardware.radio.ims@1.7.so|4ff46263854577eb9e09f85d40c3fbee298c7a94
vendor/lib64/vendor.qti.ims.callcapability@1.0.so|4068a3900aaa0045da986a9f0991cc66afdd48f5
vendor/lib64/vendor.qti.ims.callinfo@1.0.so|418f0bf4b3af5d15dd44efe1c5606772b1770e09
vendor/lib64/vendor.qti.ims.factory@1.0.so|21c91c2aea181c6bb0f66790fd82944dcf117a6d
vendor/lib64/vendor.qti.ims.rcsconfig@1.0.so|515630e936f4a40655995b58daf72b3cb374be8f
vendor/lib64/vendor.qti.ims.rcsconfig@2.0.so|aa98e9afc4cac9fa5be51bbba359a74973f9cf27
vendor/lib64/vendor.qti.ims.rcsconfig@2.1.so|62cd64dbb25d082cfdc742fb03931ba0f9abe434
vendor/lib64/vendor.qti.imsrtpservice@3.0-service-Impl.so|fa120eaa7807ff43f3974a8e0146a8c00c78f623
vendor/lib64/vendor.qti.imsrtpservice@3.0.so|460e589128fce0b0e83bb3c75aa32f7e1a9494fd

# Sensors - from FP3-REL-6.A.020.0-gms-88126537-user
system_ext/lib/vendor.qti.hardware.sensorscalibrate@1.0.so|47383a1a866f3789fc6209060c82d9331864e060
system_ext/lib64/vendor.qti.hardware.sensorscalibrate@1.0.so|a94a85b1c1344851784d97db3127db119c760f62
vendor/bin/sensors.qti|cba682ce9a06fd2e1fbc3e3d63f9df524252b34d
vendor/lib/hw/activity_recognition.msm8953.so|99ba43ace06eae105068bc2131cb1dc448160577
vendor/lib/libsensor1.so|59289e1283feea150799fd4f60b0dd146f912990
vendor/lib/libsensor_reg.so|37916892236519fd374c7fca3b04c3f4940e697e
vendor/lib/libssc_default_listener.so|d723b6df600f54afb4a6873d71424ef96f5b1bd9
vendor/lib/sensor_calibrate.so|8ecc78579b7d6f62cc42fc285ba324c96a93a1fc
vendor/lib/sensors.ssc.so|30d8799c92db27699c90e12243447d7d999fbc85
vendor/lib64/hw/activity_recognition.msm8953.so|6dedb46de4d3bbafc02430bac942b1ec78f915df
vendor/lib64/libsensor1.so|f78638f1a87b99284e7aa2daa47e44adced55b70
vendor/lib64/libsensor_reg.so|c5ba27049d5f36b0877358c154de67080b66e7de
vendor/lib64/libssc_default_listener.so|d1ca27c768a8746fc92ff5d0ed61699015853d7c
vendor/lib64/sensor_calibrate.so|572b90e2f5362144c62cdb503bcd9834eca48b10
vendor/lib64/sensors.ssc.so|aeab604388f7e41e2da7dad76bf22bcf47a632db

# TUI - from FP3-REL-6.A.020.0-gms-88126537-user
vendor/bin/hw/vendor.qti.hardware.tui_comm@1.0-service-qti|15378114c18fd1b1c8f9671f656396285ad1de48
vendor/etc/init/vendor.qti.hardware.tui_comm@1.0-service-qti.rc|2cfc563d7e1579374f001c94588fae7835a12ffc
vendor/lib/vendor.qti.hardware.tui_comm@1.0.so|ccdb6027a199d5549fc92de8ce2ddb006b4b486d
vendor/lib64/vendor.qti.hardware.tui_comm@1.0.so|f6b0e0e951394b609f0cb5c19e83a37447d9d292

# VNDK
vendor/lib/vndk-sp/libcutils.so|7276c71299f501f1de8469b8bf1baffcf60180f3
vendor/lib/vndk/libprocessgroup.so|164204f6902c40dc438c064c88afd0e2749c93f4

# Thermal - from FP3-REL-6.A.020.0-gms-88126537-user
vendor/bin/thermal-engine|7e4bd3bfdf72b669f17cd9befa7f286ebf871c38
vendor/etc/init/init_thermal-engine.rc|a0310f09da9f09c67e110607b73aec9f9f981c4c
vendor/lib/libthermalclient.so|b9c1bfd3aa5ee2d092941141bf9f6e456ee2fb43
vendor/lib64/libthermalclient.so|f95bc07fbb05944489c2890397c4a603a7cbe021

# Time services - from FP3-REL-6.A.020.0-gms-88126537-user
-vendor/app/TimeService/TimeService.apk|8f80d84574540940c1349d3488827c7ecff2cc96
vendor/bin/time_daemon|3fdbe5c7aeee2fc7e8b699bedd7309f768aae5c7
vendor/etc/init/init.time_daemon.rc|b253ca2a498757e14e1d7a051bf504ae09218f51
vendor/lib64/libtime_genoff.so|5f9b4a016db1f2d96a6b8281b6cb88d87e4cdd63
