<?xml version="1.0" encoding="UTF-8"?>
<testng-results skipped="0" failed="0" total="1" passed="1">
  <reporter-output>
  </reporter-output>
  <suite name="Suite" duration-ms="15811" started-at="2019-12-24T19:34:15Z" finished-at="2019-12-24T19:34:31Z">
    <groups>
    </groups>
    <test name="Test" duration-ms="15811" started-at="2019-12-24T19:34:15Z" finished-at="2019-12-24T19:34:31Z">
      <class name="com.main.Main">
        <test-method status="PASS" signature="beforeClass()[pri:0, instance:com.main.Main@511baa65]" name="beforeClass" is-config="true" duration-ms="12480" started-at="2019-12-25T01:04:15Z" finished-at="2019-12-25T01:04:28Z">
          <reporter-output>
          </reporter-output>
        </test-method> <!-- beforeClass -->
        <test-method status="PASS" signature="f()[pri:0, instance:com.main.Main@511baa65]" name="f" duration-ms="3315" started-at="2019-12-25T01:04:28Z" finished-at="2019-12-25T01:04:31Z">
          <reporter-output>
          </reporter-output>
        </test-method> <!-- f -->
        <test-method status="PASS" signature="afterClass()[pri:0, instance:com.main.Main@511baa65]" name="afterClass" is-config="true" duration-ms="1" started-at="2019-12-25T01:04:31Z" finished-at="2019-12-25T01:04:31Z">
          <reporter-output>
          </reporter-output>
        </test-method> <!-- afterClass -->
      </class> <!-- com.main.Main -->
    </test> <!-- Test -->
  </suite> <!-- Suite -->
</testng-results>
