<?xml version="1.0" encoding="UTF-8" standalone="no"?>
<svg
   xmlns:dc="http://purl.org/dc/elements/1.1/"
   xmlns:cc="http://creativecommons.org/ns#"
   xmlns:rdf="http://www.w3.org/1999/02/22-rdf-syntax-ns#"
   xmlns:svg="http://www.w3.org/2000/svg"
   xmlns="http://www.w3.org/2000/svg"
   xmlns:sodipodi="http://sodipodi.sourceforge.net/DTD/sodipodi-0.dtd"
   xmlns:inkscape="http://www.inkscape.org/namespaces/inkscape"
   viewBox="0 0 24 24"
   version="1.1"
   id="svg16"
   sodipodi:docname="icon-slides-white.svg"
   inkscape:version="0.92.4 (5da689c313, 2019-01-14)">
  <metadata
     id="metadata20">
    <rdf:RDF>
      <cc:Work
         rdf:about="">
        <dc:format>image/svg+xml</dc:format>
        <dc:type
           rdf:resource="http://purl.org/dc/dcmitype/StillImage" />
        <dc:title>presentation-board-graph</dc:title>
      </cc:Work>
    </rdf:RDF>
  </metadata>
  <sodipodi:namedview
     pagecolor="#ffffff"
     bordercolor="#666666"
     borderopacity="1"
     objecttolerance="10"
     gridtolerance="10"
     guidetolerance="10"
     inkscape:pageopacity="0"
     inkscape:pageshadow="2"
     inkscape:window-width="1471"
     inkscape:window-height="953"
     id="namedview18"
     showgrid="false"
     inkscape:zoom="19.666667"
     inkscape:cx="-7.1056552"
     inkscape:cy="16.135158"
     inkscape:window-x="0"
     inkscape:window-y="31"
     inkscape:window-maximized="0"
     inkscape:current-layer="svg16"
     inkscape:pagecheckerboard="true" />
  <defs
     id="defs4">
    <style
       id="style2">.a{fill:none;stroke:#000;stroke-linecap:round;stroke-miterlimit:10;}</style>
  </defs>
  <title
     id="title6">presentation-board-graph</title>
  <rect
     class="a"
     x="0.5"
     y="0.5"
     width="23"
     height="15"
     rx="1"
     ry="1"
     id="rect8"
     style="stroke:#ffffff;stroke-opacity:1;fill:#000000;fill-opacity:1;stroke-width:1.5;stroke-miterlimit:10;stroke-dasharray:none" />
  <line
     class="a"
     x1="11.5"
     y1="16.008474"
     x2="11.5"
     y2="19.418474"
     id="line10"
     style="fill:none;stroke:#ffffff;stroke-width:2;stroke-linecap:round;stroke-miterlimit:10;stroke-dasharray:none;stroke-opacity:1" />
  <path
     class="a"
     d="m 6.5,23.194915 4.293,-2.293 c 0.3905,-0.390382 1.0235,-0.390382 1.414,0 l 4.293,2.293"
     id="path12"
     style="fill:none;stroke:#feffff;stroke-width:2;stroke-linecap:round;stroke-miterlimit:10;stroke-dasharray:none;stroke-opacity:1"
     inkscape:connector-curvature="0"
     sodipodi:nodetypes="cccc" />
  <path
     class="a"
     d="M.5,8.5H6.17a.5.5,0,0,0,.46-.3L7.517,6.13a.5.5,0,0,1,.926.018l1.67,4.343a.5.5,0,0,0,.906.06l2.073-3.8a.5.5,0,0,1,.863-.026L15.507,9.21a.5.5,0,0,0,.88-.058L18.5,4.5"
     id="path14"
     style="stroke:#ffffff;stroke-opacity:1;stroke-width:1.5;stroke-miterlimit:10;stroke-dasharray:none" />
</svg>
