<?xml version="1.0" encoding="utf-8"  standalone="no"?>
<!DOCTYPE svg PUBLIC "-//W3C//DTD SVG 1.1//EN"
 "http://www.w3.org/Graphics/SVG/1.1/DTD/svg11.dtd">
<svg 
 width="600" height="400"
 viewBox="0 0 600 400"
 xmlns="http://www.w3.org/2000/svg"
 xmlns:xlink="http://www.w3.org/1999/xlink"
>

<title>Gnuplot</title>
<desc>Produced by GNUPLOT 5.0 patchlevel 5 </desc>

<g id="gnuplot_canvas">

<rect x="0" y="0" width="600" height="400" fill="none"/>
<defs>

	<circle id='gpDot' r='0.5' stroke-width='0.5'/>
	<path id='gpPt0' stroke-width='0.222' stroke='currentColor' d='M-1,0 h2 M0,-1 v2'/>
	<path id='gpPt1' stroke-width='0.222' stroke='currentColor' d='M-1,-1 L1,1 M1,-1 L-1,1'/>
	<path id='gpPt2' stroke-width='0.222' stroke='currentColor' d='M-1,0 L1,0 M0,-1 L0,1 M-1,-1 L1,1 M-1,1 L1,-1'/>
	<rect id='gpPt3' stroke-width='0.222' stroke='currentColor' x='-1' y='-1' width='2' height='2'/>
	<rect id='gpPt4' stroke-width='0.222' stroke='currentColor' fill='currentColor' x='-1' y='-1' width='2' height='2'/>
	<circle id='gpPt5' stroke-width='0.222' stroke='currentColor' cx='0' cy='0' r='1'/>
	<use xlink:href='#gpPt5' id='gpPt6' fill='currentColor' stroke='none'/>
	<path id='gpPt7' stroke-width='0.222' stroke='currentColor' d='M0,-1.33 L-1.33,0.67 L1.33,0.67 z'/>
	<use xlink:href='#gpPt7' id='gpPt8' fill='currentColor' stroke='none'/>
	<use xlink:href='#gpPt7' id='gpPt9' stroke='currentColor' transform='rotate(180)'/>
	<use xlink:href='#gpPt9' id='gpPt10' fill='currentColor' stroke='none'/>
	<use xlink:href='#gpPt3' id='gpPt11' stroke='currentColor' transform='rotate(45)'/>
	<use xlink:href='#gpPt11' id='gpPt12' fill='currentColor' stroke='none'/>
	<path id='gpPt13' stroke-width='0.222' stroke='currentColor' d='M0,1.330 L1.265,0.411 L0.782,-1.067 L-0.782,-1.076 L-1.265,0.411 z'/>
	<use xlink:href='#gpPt13' id='gpPt14' fill='currentColor' stroke='none'/>
	<filter id='textbox' filterUnits='objectBoundingBox' x='0' y='0' height='1' width='1'>
	  <feFlood flood-color='white' flood-opacity='1' result='bgnd'/>
	  <feComposite in='SourceGraphic' in2='bgnd' operator='atop'/>
	</filter>
	<filter id='greybox' filterUnits='objectBoundingBox' x='0' y='0' height='1' width='1'>
	  <feFlood flood-color='lightgrey' flood-opacity='1' result='grey'/>
	  <feComposite in='SourceGraphic' in2='grey' operator='atop'/>
	</filter>
</defs>
<g fill="none" color="white" stroke="currentColor" stroke-width="1.00" stroke-linecap="butt" stroke-linejoin="miter">
</g>
<g fill="none" color="black" stroke="currentColor" stroke-width="1.00" stroke-linecap="butt" stroke-linejoin="miter">
	<path stroke='black'  d='M53.9,364.0 L62.9,364.0 M575.0,364.0 L566.0,364.0  '/>	<g transform="translate(45.6,367.9)" stroke="none" fill="black" font-family="Arial" font-size="12.00"  text-anchor="end">
		<text><tspan font-family="Arial" >-1.5</tspan></text>
	</g>
</g>
<g fill="none" color="black" stroke="currentColor" stroke-width="1.00" stroke-linecap="butt" stroke-linejoin="miter">
	<path stroke='black'  d='M53.9,306.1 L62.9,306.1 M575.0,306.1 L566.0,306.1  '/>	<g transform="translate(45.6,310.0)" stroke="none" fill="black" font-family="Arial" font-size="12.00"  text-anchor="end">
		<text><tspan font-family="Arial" >-1</tspan></text>
	</g>
</g>
<g fill="none" color="black" stroke="currentColor" stroke-width="1.00" stroke-linecap="butt" stroke-linejoin="miter">
	<path stroke='black'  d='M53.9,248.2 L62.9,248.2 M575.0,248.2 L566.0,248.2  '/>	<g transform="translate(45.6,252.1)" stroke="none" fill="black" font-family="Arial" font-size="12.00"  text-anchor="end">
		<text><tspan font-family="Arial" >-0.5</tspan></text>
	</g>
</g>
<g fill="none" color="black" stroke="currentColor" stroke-width="1.00" stroke-linecap="butt" stroke-linejoin="miter">
	<path stroke='black'  d='M53.9,190.3 L62.9,190.3 M575.0,190.3 L566.0,190.3  '/>	<g transform="translate(45.6,194.2)" stroke="none" fill="black" font-family="Arial" font-size="12.00"  text-anchor="end">
		<text><tspan font-family="Arial" > 0</tspan></text>
	</g>
</g>
<g fill="none" color="black" stroke="currentColor" stroke-width="1.00" stroke-linecap="butt" stroke-linejoin="miter">
	<path stroke='black'  d='M53.9,132.5 L62.9,132.5 M575.0,132.5 L566.0,132.5  '/>	<g transform="translate(45.6,136.4)" stroke="none" fill="black" font-family="Arial" font-size="12.00"  text-anchor="end">
		<text><tspan font-family="Arial" > 0.5</tspan></text>
	</g>
</g>
<g fill="none" color="black" stroke="currentColor" stroke-width="1.00" stroke-linecap="butt" stroke-linejoin="miter">
	<path stroke='black'  d='M53.9,74.6 L62.9,74.6 M575.0,74.6 L566.0,74.6  '/>	<g transform="translate(45.6,78.5)" stroke="none" fill="black" font-family="Arial" font-size="12.00"  text-anchor="end">
		<text><tspan font-family="Arial" > 1</tspan></text>
	</g>
</g>
<g fill="none" color="black" stroke="currentColor" stroke-width="1.00" stroke-linecap="butt" stroke-linejoin="miter">
	<path stroke='black'  d='M53.9,16.7 L62.9,16.7 M575.0,16.7 L566.0,16.7  '/>	<g transform="translate(45.6,20.6)" stroke="none" fill="black" font-family="Arial" font-size="12.00"  text-anchor="end">
		<text><tspan font-family="Arial" > 1.5</tspan></text>
	</g>
</g>
<g fill="none" color="black" stroke="currentColor" stroke-width="1.00" stroke-linecap="butt" stroke-linejoin="miter">
	<path stroke='black'  d='M53.9,364.0 L53.9,355.0 M53.9,16.7 L53.9,25.7  '/>	<g transform="translate(53.9,385.9)" stroke="none" fill="black" font-family="Arial" font-size="12.00"  text-anchor="middle">
		<text><tspan font-family="Arial" >-2</tspan></text>
	</g>
</g>
<g fill="none" color="black" stroke="currentColor" stroke-width="1.00" stroke-linecap="butt" stroke-linejoin="miter">
	<path stroke='black'  d='M119.0,364.0 L119.0,355.0 M119.0,16.7 L119.0,25.7  '/>	<g transform="translate(119.0,385.9)" stroke="none" fill="black" font-family="Arial" font-size="12.00"  text-anchor="middle">
		<text><tspan font-family="Arial" >-1.5</tspan></text>
	</g>
</g>
<g fill="none" color="black" stroke="currentColor" stroke-width="1.00" stroke-linecap="butt" stroke-linejoin="miter">
	<path stroke='black'  d='M184.2,364.0 L184.2,355.0 M184.2,16.7 L184.2,25.7  '/>	<g transform="translate(184.2,385.9)" stroke="none" fill="black" font-family="Arial" font-size="12.00"  text-anchor="middle">
		<text><tspan font-family="Arial" >-1</tspan></text>
	</g>
</g>
<g fill="none" color="black" stroke="currentColor" stroke-width="1.00" stroke-linecap="butt" stroke-linejoin="miter">
	<path stroke='black'  d='M249.3,364.0 L249.3,355.0 M249.3,16.7 L249.3,25.7  '/>	<g transform="translate(249.3,385.9)" stroke="none" fill="black" font-family="Arial" font-size="12.00"  text-anchor="middle">
		<text><tspan font-family="Arial" >-0.5</tspan></text>
	</g>
</g>
<g fill="none" color="black" stroke="currentColor" stroke-width="1.00" stroke-linecap="butt" stroke-linejoin="miter">
	<path stroke='black'  d='M314.5,364.0 L314.5,355.0 M314.5,16.7 L314.5,25.7  '/>	<g transform="translate(314.5,385.9)" stroke="none" fill="black" font-family="Arial" font-size="12.00"  text-anchor="middle">
		<text><tspan font-family="Arial" > 0</tspan></text>
	</g>
</g>
<g fill="none" color="black" stroke="currentColor" stroke-width="1.00" stroke-linecap="butt" stroke-linejoin="miter">
	<path stroke='black'  d='M379.6,364.0 L379.6,355.0 M379.6,16.7 L379.6,25.7  '/>	<g transform="translate(379.6,385.9)" stroke="none" fill="black" font-family="Arial" font-size="12.00"  text-anchor="middle">
		<text><tspan font-family="Arial" > 0.5</tspan></text>
	</g>
</g>
<g fill="none" color="black" stroke="currentColor" stroke-width="1.00" stroke-linecap="butt" stroke-linejoin="miter">
	<path stroke='black'  d='M444.7,364.0 L444.7,355.0 M444.7,16.7 L444.7,25.7  '/>	<g transform="translate(444.7,385.9)" stroke="none" fill="black" font-family="Arial" font-size="12.00"  text-anchor="middle">
		<text><tspan font-family="Arial" > 1</tspan></text>
	</g>
</g>
<g fill="none" color="black" stroke="currentColor" stroke-width="1.00" stroke-linecap="butt" stroke-linejoin="miter">
	<path stroke='black'  d='M509.9,364.0 L509.9,355.0 M509.9,16.7 L509.9,25.7  '/>	<g transform="translate(509.9,385.9)" stroke="none" fill="black" font-family="Arial" font-size="12.00"  text-anchor="middle">
		<text><tspan font-family="Arial" > 1.5</tspan></text>
	</g>
</g>
<g fill="none" color="black" stroke="currentColor" stroke-width="1.00" stroke-linecap="butt" stroke-linejoin="miter">
	<path stroke='black'  d='M575.0,364.0 L575.0,355.0 M575.0,16.7 L575.0,25.7  '/>	<g transform="translate(575.0,385.9)" stroke="none" fill="black" font-family="Arial" font-size="12.00"  text-anchor="middle">
		<text><tspan font-family="Arial" > 2</tspan></text>
	</g>
</g>
<g fill="none" color="black" stroke="currentColor" stroke-width="1.00" stroke-linecap="butt" stroke-linejoin="miter">
</g>
<g fill="none" color="black" stroke="currentColor" stroke-width="1.00" stroke-linecap="butt" stroke-linejoin="miter">
	<path stroke='black'  d='M53.9,16.7 L53.9,364.0 L575.0,364.0 L575.0,16.7 L53.9,16.7 Z  '/></g>
<g fill="none" color="black" stroke="currentColor" stroke-width="1.00" stroke-linecap="butt" stroke-linejoin="miter">
</g>
	<g id="gnuplot_plot_1" ><title>2D cubic spline</title>
<g fill="none" color="white" stroke="black" stroke-width="1.50" stroke-linecap="butt" stroke-linejoin="miter">
</g>
<g fill="none" color="black" stroke="currentColor" stroke-width="1.50" stroke-linecap="butt" stroke-linejoin="miter">
	<g transform="translate(507.9,38.6)" stroke="none" fill="black" font-family="Arial" font-size="12.00"  text-anchor="end">
		<text><tspan font-family="Arial" >2D cubic spline</tspan></text>
	</g>
</g>
<g fill="none" color="black" stroke="currentColor" stroke-width="1.50" stroke-linecap="butt" stroke-linejoin="miter">
	<path stroke='rgb(  0,   0, 255)'  d='M516.2,34.7 L558.4,34.7 M314.5,190.3 L325.7,175.7 L338.1,160.3 L351.4,144.7 L365.4,129.4 L379.6,114.9
		L393.8,101.8 L407.7,90.7 L421.1,82.1 L433.5,76.6 L444.7,74.6 L453.3,76.1 L458.2,80.6 L460.2,87.8
		L459.9,97.4 L457.9,109.1 L454.8,122.6 L451.4,137.8 L448.1,154.3 L445.7,171.9 L444.7,190.4 L446.6,207.9
		L451.5,223.4 L458.0,237.0 L465.0,249.1 L471.1,259.9 L475.1,269.9 L475.7,279.1 L471.7,288.1 L461.8,297.0
		L444.7,306.1 L421.8,315.0 L395.7,322.6 L367.4,328.7 L337.8,333.1 L307.9,335.4 L278.4,335.3 L250.4,332.7
		L224.8,327.1 L202.4,318.3 L184.2,306.1 L173.2,291.6 L170.7,276.1 L175.0,259.8 L184.3,242.7 L197.0,225.1
		L211.2,207.1 L225.3,188.7 L237.5,170.0 L246.1,151.2 L249.3,132.5  '/>	<use xlink:href='#gpPt0' transform='translate(314.5,190.3) scale(4.50)' color='rgb(  0,   0, 255)'/>
	<use xlink:href='#gpPt0' transform='translate(325.7,175.7) scale(4.50)' color='rgb(  0,   0, 255)'/>
	<use xlink:href='#gpPt0' transform='translate(338.1,160.3) scale(4.50)' color='rgb(  0,   0, 255)'/>
	<use xlink:href='#gpPt0' transform='translate(351.4,144.7) scale(4.50)' color='rgb(  0,   0, 255)'/>
	<use xlink:href='#gpPt0' transform='translate(365.4,129.4) scale(4.50)' color='rgb(  0,   0, 255)'/>
	<use xlink:href='#gpPt0' transform='translate(379.6,114.9) scale(4.50)' color='rgb(  0,   0, 255)'/>
	<use xlink:href='#gpPt0' transform='translate(393.8,101.8) scale(4.50)' color='rgb(  0,   0, 255)'/>
	<use xlink:href='#gpPt0' transform='translate(407.7,90.7) scale(4.50)' color='rgb(  0,   0, 255)'/>
	<use xlink:href='#gpPt0' transform='translate(421.1,82.1) scale(4.50)' color='rgb(  0,   0, 255)'/>
	<use xlink:href='#gpPt0' transform='translate(433.5,76.6) scale(4.50)' color='rgb(  0,   0, 255)'/>
	<use xlink:href='#gpPt0' transform='translate(444.7,74.6) scale(4.50)' color='rgb(  0,   0, 255)'/>
	<use xlink:href='#gpPt0' transform='translate(453.3,76.1) scale(4.50)' color='rgb(  0,   0, 255)'/>
	<use xlink:href='#gpPt0' transform='translate(458.2,80.6) scale(4.50)' color='rgb(  0,   0, 255)'/>
	<use xlink:href='#gpPt0' transform='translate(460.2,87.8) scale(4.50)' color='rgb(  0,   0, 255)'/>
	<use xlink:href='#gpPt0' transform='translate(459.9,97.4) scale(4.50)' color='rgb(  0,   0, 255)'/>
	<use xlink:href='#gpPt0' transform='translate(457.9,109.1) scale(4.50)' color='rgb(  0,   0, 255)'/>
	<use xlink:href='#gpPt0' transform='translate(454.8,122.6) scale(4.50)' color='rgb(  0,   0, 255)'/>
	<use xlink:href='#gpPt0' transform='translate(451.4,137.8) scale(4.50)' color='rgb(  0,   0, 255)'/>
	<use xlink:href='#gpPt0' transform='translate(448.1,154.3) scale(4.50)' color='rgb(  0,   0, 255)'/>
	<use xlink:href='#gpPt0' transform='translate(445.7,171.9) scale(4.50)' color='rgb(  0,   0, 255)'/>
	<use xlink:href='#gpPt0' transform='translate(444.7,190.4) scale(4.50)' color='rgb(  0,   0, 255)'/>
	<use xlink:href='#gpPt0' transform='translate(446.6,207.9) scale(4.50)' color='rgb(  0,   0, 255)'/>
	<use xlink:href='#gpPt0' transform='translate(451.5,223.4) scale(4.50)' color='rgb(  0,   0, 255)'/>
	<use xlink:href='#gpPt0' transform='translate(458.0,237.0) scale(4.50)' color='rgb(  0,   0, 255)'/>
	<use xlink:href='#gpPt0' transform='translate(465.0,249.1) scale(4.50)' color='rgb(  0,   0, 255)'/>
	<use xlink:href='#gpPt0' transform='translate(471.1,259.9) scale(4.50)' color='rgb(  0,   0, 255)'/>
	<use xlink:href='#gpPt0' transform='translate(475.1,269.9) scale(4.50)' color='rgb(  0,   0, 255)'/>
	<use xlink:href='#gpPt0' transform='translate(475.7,279.1) scale(4.50)' color='rgb(  0,   0, 255)'/>
	<use xlink:href='#gpPt0' transform='translate(471.7,288.1) scale(4.50)' color='rgb(  0,   0, 255)'/>
	<use xlink:href='#gpPt0' transform='translate(461.8,297.0) scale(4.50)' color='rgb(  0,   0, 255)'/>
	<use xlink:href='#gpPt0' transform='translate(444.7,306.1) scale(4.50)' color='rgb(  0,   0, 255)'/>
	<use xlink:href='#gpPt0' transform='translate(421.8,315.0) scale(4.50)' color='rgb(  0,   0, 255)'/>
	<use xlink:href='#gpPt0' transform='translate(395.7,322.6) scale(4.50)' color='rgb(  0,   0, 255)'/>
	<use xlink:href='#gpPt0' transform='translate(367.4,328.7) scale(4.50)' color='rgb(  0,   0, 255)'/>
	<use xlink:href='#gpPt0' transform='translate(337.8,333.1) scale(4.50)' color='rgb(  0,   0, 255)'/>
	<use xlink:href='#gpPt0' transform='translate(307.9,335.4) scale(4.50)' color='rgb(  0,   0, 255)'/>
	<use xlink:href='#gpPt0' transform='translate(278.4,335.3) scale(4.50)' color='rgb(  0,   0, 255)'/>
	<use xlink:href='#gpPt0' transform='translate(250.4,332.7) scale(4.50)' color='rgb(  0,   0, 255)'/>
	<use xlink:href='#gpPt0' transform='translate(224.8,327.1) scale(4.50)' color='rgb(  0,   0, 255)'/>
	<use xlink:href='#gpPt0' transform='translate(202.4,318.3) scale(4.50)' color='rgb(  0,   0, 255)'/>
	<use xlink:href='#gpPt0' transform='translate(184.2,306.1) scale(4.50)' color='rgb(  0,   0, 255)'/>
	<use xlink:href='#gpPt0' transform='translate(173.2,291.6) scale(4.50)' color='rgb(  0,   0, 255)'/>
	<use xlink:href='#gpPt0' transform='translate(170.7,276.1) scale(4.50)' color='rgb(  0,   0, 255)'/>
	<use xlink:href='#gpPt0' transform='translate(175.0,259.8) scale(4.50)' color='rgb(  0,   0, 255)'/>
	<use xlink:href='#gpPt0' transform='translate(184.3,242.7) scale(4.50)' color='rgb(  0,   0, 255)'/>
	<use xlink:href='#gpPt0' transform='translate(197.0,225.1) scale(4.50)' color='rgb(  0,   0, 255)'/>
	<use xlink:href='#gpPt0' transform='translate(211.2,207.1) scale(4.50)' color='rgb(  0,   0, 255)'/>
	<use xlink:href='#gpPt0' transform='translate(225.3,188.7) scale(4.50)' color='rgb(  0,   0, 255)'/>
	<use xlink:href='#gpPt0' transform='translate(237.5,170.0) scale(4.50)' color='rgb(  0,   0, 255)'/>
	<use xlink:href='#gpPt0' transform='translate(246.1,151.2) scale(4.50)' color='rgb(  0,   0, 255)'/>
	<use xlink:href='#gpPt0' transform='translate(249.3,132.5) scale(4.50)' color='rgb(  0,   0, 255)'/>
	<use xlink:href='#gpPt0' transform='translate(537.3,34.7) scale(4.50)' color='rgb(  0,   0, 255)'/>
</g>
	</g>
	<g id="gnuplot_plot_2" ><title>control points</title>
<g fill="none" color="black" stroke="currentColor" stroke-width="1.50" stroke-linecap="butt" stroke-linejoin="miter">
	<g transform="translate(507.9,56.6)" stroke="none" fill="black" font-family="Arial" font-size="12.00"  text-anchor="end">
		<text><tspan font-family="Arial" >control points</tspan></text>
	</g>
</g>
<g fill="none" color="black" stroke="currentColor" stroke-width="1.50" stroke-linecap="butt" stroke-linejoin="miter">
	<path stroke='rgb(255,   0,   0)'  d='M516.2,52.7 L558.4,52.7 M314.5,248.2 L314.5,190.3 L444.7,74.6 L444.7,190.3 L444.7,306.1 L184.2,306.1
		L249.3,132.5 L184.2,74.6  '/>	<use xlink:href='#gpPt1' transform='translate(314.5,248.2) scale(4.50)' color='rgb(255,   0,   0)'/>
	<use xlink:href='#gpPt1' transform='translate(314.5,190.3) scale(4.50)' color='rgb(255,   0,   0)'/>
	<use xlink:href='#gpPt1' transform='translate(444.7,74.6) scale(4.50)' color='rgb(255,   0,   0)'/>
	<use xlink:href='#gpPt1' transform='translate(444.7,190.3) scale(4.50)' color='rgb(255,   0,   0)'/>
	<use xlink:href='#gpPt1' transform='translate(444.7,306.1) scale(4.50)' color='rgb(255,   0,   0)'/>
	<use xlink:href='#gpPt1' transform='translate(184.2,306.1) scale(4.50)' color='rgb(255,   0,   0)'/>
	<use xlink:href='#gpPt1' transform='translate(249.3,132.5) scale(4.50)' color='rgb(255,   0,   0)'/>
	<use xlink:href='#gpPt1' transform='translate(184.2,74.6) scale(4.50)' color='rgb(255,   0,   0)'/>
	<use xlink:href='#gpPt1' transform='translate(537.3,52.7) scale(4.50)' color='rgb(255,   0,   0)'/>
</g>
	</g>
<g fill="none" color="white" stroke="rgb(255,   0,   0)" stroke-width="2.00" stroke-linecap="butt" stroke-linejoin="miter">
</g>
<g fill="none" color="black" stroke="currentColor" stroke-width="2.00" stroke-linecap="butt" stroke-linejoin="miter">
</g>
<g fill="none" color="black" stroke="black" stroke-width="1.00" stroke-linecap="butt" stroke-linejoin="miter">
</g>
<g fill="none" color="black" stroke="currentColor" stroke-width="1.00" stroke-linecap="butt" stroke-linejoin="miter">
	<path stroke='black'  d='M53.9,16.7 L53.9,364.0 L575.0,364.0 L575.0,16.7 L53.9,16.7 Z  '/></g>
<g fill="none" color="black" stroke="currentColor" stroke-width="1.00" stroke-linecap="butt" stroke-linejoin="miter">
</g>
</g>
</svg>

