<?xml version="1.0" encoding="UTF-8" standalone="no"?>
<!DOCTYPE svg PUBLIC "-//W3C//DTD SVG 1.1//EN"
 "http://www.w3.org/Graphics/SVG/1.1/DTD/svg11.dtd">
<!-- Generated by graphviz version 2.38.0 (20140413.2041)
 -->
<!-- Title: %3 Pages: 1 -->
<svg width="196pt" height="392pt"
 viewBox="0.00 0.00 196.10 392.00" xmlns="http://www.w3.org/2000/svg" xmlns:xlink="http://www.w3.org/1999/xlink">
<g id="graph0" class="graph" transform="scale(1 1) rotate(0) translate(4 388)">
<title>%3</title>
<polygon fill="white" stroke="none" points="-4,4 -4,-388 192.096,-388 192.096,4 -4,4"/>
<!-- Douarnenez -->
<g id="node1" class="node"><title>Douarnenez</title>
<ellipse fill="none" stroke="black" cx="126.096" cy="-366" rx="54.6905" ry="18"/>
<text text-anchor="middle" x="126.096" y="-362.3" font-family="Times,serif" font-size="14.00">Douarnenez</text>
</g>
<!-- Pouldreuzic -->
<g id="node2" class="node"><title>Pouldreuzic</title>
<ellipse fill="none" stroke="black" cx="93.0957" cy="-279" rx="53.0913" ry="18"/>
<text text-anchor="middle" x="93.0957" y="-275.3" font-family="Times,serif" font-size="14.00">Pouldreuzic</text>
</g>
<!-- Douarnenez&#45;&#45;Pouldreuzic -->
<g id="edge1" class="edge"><title>Douarnenez&#45;&#45;Pouldreuzic</title>
<path fill="none" stroke="red" stroke-width="3" d="M119.418,-347.799C113.655,-332.955 105.378,-311.637 99.6512,-296.885"/>
</g>
<!-- Plomelin -->
<g id="node5" class="node"><title>Plomelin</title>
<ellipse fill="none" stroke="black" cx="132.096" cy="-18" rx="43.5923" ry="18"/>
<text text-anchor="middle" x="132.096" y="-14.3" font-family="Times,serif" font-size="14.00">Plomelin</text>
</g>
<!-- Douarnenez&#45;&#45;Plomelin -->
<g id="edge4" class="edge"><title>Douarnenez&#45;&#45;Plomelin</title>
<path fill="none" stroke="black" d="M131.324,-347.865C143.764,-304.711 174.096,-199.5 174.096,-199.5 174.096,-199.5 146.9,-81.9748 136.276,-36.0665"/>
<text text-anchor="middle" x="181.096" y="-188.3" font-family="Times,serif" font-size="14.00">25</text>
</g>
<!-- Pouldreuzic&#45;&#45;Douarnenez -->
<g id="edge5" class="edge"><title>Pouldreuzic&#45;&#45;Douarnenez</title>
<path fill="none" stroke="black" d="M99.6512,-296.885C105.378,-311.637 113.655,-332.955 119.418,-347.799"/>
<text text-anchor="middle" x="118.096" y="-318.8" font-family="Times,serif" font-size="14.00">17</text>
</g>
<!-- Plouneour -->
<g id="node3" class="node"><title>Plouneour</title>
<ellipse fill="none" stroke="black" cx="81.0957" cy="-192" rx="48.1917" ry="18"/>
<text text-anchor="middle" x="81.0957" y="-188.3" font-family="Times,serif" font-size="14.00">Plouneour</text>
</g>
<!-- Pouldreuzic&#45;&#45;Plouneour -->
<g id="edge2" class="edge"><title>Pouldreuzic&#45;&#45;Plouneour</title>
<path fill="none" stroke="red" stroke-width="3" d="M90.6674,-260.799C88.5854,-246.052 85.6014,-224.915 83.5205,-210.175"/>
</g>
<!-- Plouneour&#45;&#45;Pouldreuzic -->
<g id="edge7" class="edge"><title>Plouneour&#45;&#45;Pouldreuzic</title>
<path fill="none" stroke="black" d="M83.5205,-210.175C85.6014,-224.915 88.5854,-246.052 90.6674,-260.799"/>
<text text-anchor="middle" x="91.5957" y="-231.8" font-family="Times,serif" font-size="14.00">9</text>
</g>
<!-- LaTorche -->
<g id="node4" class="node"><title>LaTorche</title>
<ellipse fill="none" stroke="black" cx="48.0957" cy="-105" rx="48.1917" ry="18"/>
<text text-anchor="middle" x="48.0957" y="-101.3" font-family="Times,serif" font-size="14.00">LaTorche</text>
</g>
<!-- Plouneour&#45;&#45;LaTorche -->
<g id="edge3" class="edge"><title>Plouneour&#45;&#45;LaTorche</title>
<path fill="none" stroke="red" stroke-width="3" d="M74.4177,-173.799C68.6547,-158.955 60.3782,-137.637 54.6512,-122.885"/>
</g>
<!-- Plouneour&#45;&#45;Plomelin -->
<g id="edge6" class="edge"><title>Plouneour&#45;&#45;Plomelin</title>
<path fill="none" stroke="black" d="M92.4143,-174.356C107.439,-150.935 132.096,-112.5 132.096,-112.5 132.096,-112.5 132.096,-63.6812 132.096,-36.2206"/>
<text text-anchor="middle" x="139.096" y="-101.3" font-family="Times,serif" font-size="14.00">11</text>
</g>
<!-- LaTorche&#45;&#45;Plouneour -->
<g id="edge8" class="edge"><title>LaTorche&#45;&#45;Plouneour</title>
<path fill="none" stroke="black" d="M54.6512,-122.885C60.3782,-137.637 68.6547,-158.955 74.4177,-173.799"/>
<text text-anchor="middle" x="74.0957" y="-144.8" font-family="Times,serif" font-size="14.00">10</text>
</g>
<!-- LaTorche&#45;&#45;Plomelin -->
<g id="edge9" class="edge"><title>LaTorche&#45;&#45;Plomelin</title>
<path fill="none" stroke="black" d="M64.2918,-87.6111C79.2616,-72.4631 101.372,-50.0895 116.234,-35.0503"/>
<text text-anchor="middle" x="102.096" y="-57.8" font-family="Times,serif" font-size="14.00">20</text>
</g>
</g>
</svg>
