2288.0
143.0
314.0
50.0
1716.0
128.0
171.0
57.0
1430.0
125.0
89.0
63.0
1232.0
77.0
169.0
27.0
1408.0
88.0
193.0
31.0
1584.0
99.0
217.0
35.0
1760.0
110.0
242.0
39.0
1936.0
121.0
266.0
43.0
2112.0
132.0
290.0
46.0
2288.0
143.0
314.0
50.0
2464.0
154.0
338.0
54.0
2640.0
165.0
363.0
58.0
2816.0
176.0
387.0
62.0
2992.0
187.0
411.0
66.0
3168.0
198.0
435.0
70.0
3344.0
209.0
459.0
74.0
3520.0
220.0
484.0
78.0
3696.0
231.0
508.0
82.0
3872.0
242.0
532.0
86.0
4048.0
253.0
556.0
89.0
4224.0
264.0
580.0
93.0
4400.0
275.0
605.0
97.0
4576.0
286.0
629.0
101.0
4752.0
297.0
653.0
105.0
4928.0
308.0
677.0
109.0
5104.0
319.0
701.0
113.0
5280.0
330.0
726.0
117.0
5456.0
341.0
750.0
121.0
5632.0
352.0
774.0
125.0
5808.0
363.0
798.0
129.0
5984.0
374.0
822.0
132.0
6160.0
385.0
847.0
136.0
6336.0
396.0
871.0
140.0
6512.0
407.0
895.0
144.0
6688.0
418.0
919.0
148.0
6864.0
429.0
943.0
152.0
2288.0
143.0
314.0
50.0
2574.0
160.0
353.0
57.0
3146.0
196.0
432.0
69.0