Th-232 -------------------------------------------------------------------------
  Zr-95,5.5230 ± 3.1 %,,9.9187e-04 ± 36.3 %,
  Nb-95,5.5196 ± 3.1 %,,1.3603e-07 ± 36.3 %,
 Ru-103,0.1538 ± 6.2 %,,
 Ru-106,0.0541 ± 5.7 %,,4.2920e-08 ± 36.9 %,
 Rh-106,0.0541 ± 5.7 %,,
 Cs-137,6.2965 ± 4.7 %,,5.1397e-03 ± 37.5 %,
Ba-137m,5.9439 ± 4.8 %,,1.2822e-06 ± 37.6 %,
 Ba-140,7.7121 ± 3.2 %,,1.9353e-02 ± 37.2 %,
 La-140,7.7121 ± 3.2 %,,9.5381e-06 ± 37.5 %,
 Ce-144,7.6634 ± 7.2 %,,1.0566e-03 ± 38.9 %,
U-235 --------------------------------------------------------------------------
  Zr-95,6.3488 ± 1.3 %,6.5018 ± 1.1 %,9.3065e-03 ± 36.3 %,3.5346e-02 ± 36.7 %
  Nb-95,6.3449 ± 1.3 %,6.4979 ± 1.1 %,1.8286e-06 ± 36.4 %,1.7529e-05 ± 36.9 %
 Ru-103,3.2481 ± 1.3 %,3.1033 ± 2.7 %,2.3559e-07 ± 35.7 %,9.9410e-06 ± 36.1 %
 Ru-106,0.4690 ± 7.7 %,0.4103 ± 2.6 %,3.4840e-06 ± 36.8 %,2.7725e-06 ± 41.1 %
 Rh-106,0.4690 ± 7.7 %,0.4103 ± 2.6 %
 Cs-137,5.8889 ± 1.6 %,6.2208 ± 1.1 %,1.2247e-01 ± 35.9 %,7.2248e-02 ± 35.4 %
Ba-137m,5.5592 ± 1.9 %,5.8725 ± 1.4 %,1.2307e-04 ± 36.3 %,1.2770e-04 ± 35.7 %
 Ba-140,5.9594 ± 0.8 %,6.3142 ± 1.5 %,2.7788e-01 ± 35.1 %,2.9300e-01 ± 34.8 %
 La-140,5.9599 ± 0.8 %,6.3147 ± 1.5 %,5.7389e-04 ± 36.1 %,5.1535e-04 ± 36.2 %
 Ce-144,5.0943 ± 1.5 %,5.4744 ± 1.0 %,2.1896e-02 ± 36.8 %,3.4698e-02 ± 37.5 %
Np-237 -------------------------------------------------------------------------
  Zr-95,5.6147 ± 2.7 %,,3.5622e-02 ± 35.4 %,
  Nb-95,5.6114 ± 2.7 %,,3.2984e-05 ± 35.4 %,
 Ru-103,5.4305 ± 12.7 %,,2.0067e-05 ± 35.3 %,
 Ru-106,2.2791 ± 13.1 %,,5.2077e-02 ± 36.7 %,
 Rh-106,2.2791 ± 13.1 %,,4.1438e-05 ± 36.0 %,
 Cs-137,6.2654 ± 3.7 %,,3.7395e-01 ± 34.6 %,
Ba-137m,5.9160 ± 3.8 %,,1.4802e-03 ± 35.7 %,
 Ba-140,5.7380 ± 2.3 %,,6.8574e-01 ± 35.6 %,
 La-140,5.7444 ± 2.3 %,,6.3568e-03 ± 36.7 %,
 Ce-144,4.1230 ± 4.7 %,,1.2094e-01 ± 36.1 %,
U-238 --------------------------------------------------------------------------
  Zr-95,5.1883 ± 1.7 %,,9.3909e-04 ± 36.2 %,
  Nb-95,5.1851 ± 1.7 %,,1.3214e-07 ± 36.2 %,
 Ru-103,6.0288 ± 1.6 %,,7.0101e-08 ± 36.4 %,
 Ru-106,2.5185 ± 4.3 %,,1.9699e-03 ± 38.4 %,
 Rh-106,2.5185 ± 4.3 %,,1.8219e-07 ± 38.4 %,
 Cs-137,6.0222 ± 2.5 %,,4.3585e-03 ± 36.4 %,
Ba-137m,5.6849 ± 2.7 %,,1.0169e-06 ± 36.4 %,
 Ba-140,5.9718 ± 1.4 %,,1.4242e-02 ± 36.5 %,
 La-140,5.9718 ± 1.4 %,,6.8165e-06 ± 36.7 %,
 Ce-144,4.6682 ± 2.5 %,,6.6093e-04 ± 36.2 %,
Pu-239 -------------------------------------------------------------------------
  Zr-95,4.6825 ± 2.1 %,4.9486 ± 2.0 %,5.7563e-02 ± 36.5 %,1.3294e-01 ± 36.4 %
  Nb-95,4.6798 ± 2.1 %,4.9461 ± 2.0 %,8.4638e-05 ± 36.5 %,3.6286e-04 ± 36.5 %
 Ru-103,6.5875 ± 2.4 %,6.9481 ± 1.2 %,8.2824e-05 ± 36.2 %,3.5212e-04 ± 35.7 %
 Ru-106,4.1256 ± 5.9 %,4.1876 ± 2.2 %,1.8683e-01 ± 38.7 %,2.9847e-01 ± 34.9 %
 Rh-106,4.1259 ± 5.9 %,4.1884 ± 2.2 %,2.5465e-04 ± 37.6 %,8.2388e-04 ± 36.4 %
 Cs-137,6.3518 ± 1.9 %,6.5881 ± 1.2 %,6.9485e-01 ± 35.7 %,4.5666e-01 ± 35.4 %
Ba-137m,6.0017 ± 2.1 %,6.2229 ± 1.5 %,5.5669e-03 ± 36.6 %,3.7806e-03 ± 36.2 %
 Ba-140,5.3035 ± 1.4 %,5.3220 ± 1.1 %,1.1145e+00 ± 31.8 %,8.7561e-01 ± 32.4 %
 La-140,5.3244 ± 1.4 %,5.3333 ± 1.1 %,2.0861e-02 ± 36.2 %,1.1261e-02 ± 35.6 %
 Ce-144,3.5039 ± 1.5 %,3.7549 ± 0.8 %,2.4345e-01 ± 36.1 %,1.6345e-01 ± 36.8 %

