<?xml version="1.0" encoding="UTF-8" standalone="no"?>
<svg
   xmlns:dc="http://purl.org/dc/elements/1.1/"
   xmlns:cc="http://creativecommons.org/ns#"
   xmlns:rdf="http://www.w3.org/1999/02/22-rdf-syntax-ns#"
   xmlns:svg="http://www.w3.org/2000/svg"
   xmlns="http://www.w3.org/2000/svg"
   xmlns:sodipodi="http://sodipodi.sourceforge.net/DTD/sodipodi-0.dtd"
   xmlns:inkscape="http://www.inkscape.org/namespaces/inkscape"
   inkscape:version="1.0alpha (e25c9f7d36, 2019-01-13)"
   inkscape:export-ydpi="76.800003"
   inkscape:export-xdpi="76.800003"
   inkscape:export-filename="/home/diraol/devel/ask/conectas/doacoes/public/assets/images/innovation_color.png"
   height="640"
   width="640"
   sodipodi:docname="innovation_color.svg"
   xml:space="preserve"
   viewBox="0 0 640 640"
   y="0px"
   x="0px"
   id="Capa_1"
   version="1.1"><metadata
   id="metadata95">
  <rdf:RDF>
    <cc:Work
       rdf:about="">
      <dc:format>image/svg+xml</dc:format>
      <dc:type
         rdf:resource="http://purl.org/dc/dcmitype/StillImage" />
      <dc:title></dc:title>
    </cc:Work>
  </rdf:RDF>
</metadata>
<defs
   id="defs93">
	
	
	
	
	
	
	
	
</defs>
<sodipodi:namedview
   inkscape:current-layer="Capa_1"
   inkscape:window-maximized="0"
   inkscape:window-y="37"
   inkscape:window-x="2646"
   inkscape:cy="244"
   inkscape:cx="244"
   inkscape:zoom="1.182377"
   showgrid="false"
   id="namedview91"
   inkscape:window-height="1041"
   inkscape:window-width="1276"
   inkscape:pageshadow="2"
   inkscape:pageopacity="0"
   guidetolerance="10"
   gridtolerance="10"
   objecttolerance="10"
   borderopacity="1"
   inkscape:document-rotation="0"
   bordercolor="#666666"
   pagecolor="#ffffff" />
























<g
   transform="translate(76,75.051)"
   id="g164">
  <path
     inkscape:connector-curvature="0"
     style="fill:#dbe6fd"
     d="m 408,166.386 c 0,41.189 -16.619,97.556 -43.854,145.762 C 347.75,341.169 312,394.16 312,427.439 H 240 V 11.72 c 92.784,0 168,66.998 168,154.666 z"
     id="path2" />
  <path
     inkscape:connector-curvature="0"
     style="fill:#ffd700"
     d="m 72,166.667 c 0,41.189 16.619,97.556 43.854,145.762 C 132.25,341.45 168,394.441 168,427.72 h 72 V 12.001 c -92.784,0 -168,66.998 -168,154.666 z"
     id="path4" />
  <g
     id="g32">
	<path
   inkscape:connector-curvature="0"
   style="fill:#0a9ec1"
   d="m 324.555,391.204 -14.875,-5.891 c 2.155,-5.362 4.651,-10.581 7.473,-15.625 l 14.008,7.734 c -2.494,4.45 -4.7,9.053 -6.606,13.782 z"
   id="path6" />

	<path
   inkscape:connector-curvature="0"
   style="fill:#0a9ec1"
   d="m 339.297,363.947 -13.43,-8.688 c 3,-4.641 6.137,-9.234 9.281,-13.75 l 13.133,9.141 c -3.043,4.375 -6.078,8.812 -8.984,13.297 z"
   id="path8" />

	<path
   inkscape:connector-curvature="0"
   style="fill:#0a9ec1"
   d="m 357.629,337.275 -13.141,-9.125 c 3.152,-4.547 6.16,-8.977 8.859,-13.258 l 13.539,8.516 c -2.816,4.484 -5.956,9.117 -9.257,13.867 z"
   id="path10" />

	<path
   inkscape:connector-curvature="0"
   style="fill:#0a9ec1"
   d="m 375.277,308.782 -14.109,-7.547 c 2.5,-4.68 4.897,-9.422 7.191,-14.227 l 14.438,6.891 c -2.395,5.016 -4.901,9.977 -7.52,14.883 z"
   id="path12" />

	<path
   inkscape:connector-curvature="0"
   style="fill:#0a9ec1"
   d="m 389.648,278.728 -14.727,-6.266 c 2.094,-4.914 4.074,-9.867 5.934,-14.812 l 14.977,5.625 c -1.937,5.164 -3.999,10.315 -6.184,15.453 z"
   id="path14" />

	<path
   inkscape:connector-curvature="0"
   style="fill:#0a9ec1"
   d="m 415.324,182.087 -15.945,-1.344 c 0.414,-4.875 0.621,-9.617 0.621,-14.078 l -0.008,-1.469 16,-0.125 0.008,1.594 c 0,4.914 -0.227,10.102 -0.676,15.422 z"
   id="path16" />

	<path
   inkscape:connector-curvature="0"
   style="fill:#0a9ec1"
   d="m 399.004,149.822 c -0.606,-5.1 -1.495,-10.163 -2.664,-15.164 l 15.578,-3.641 c 1.304,5.579 2.298,11.225 2.977,16.914 z"
   id="path18" />

	<path
   inkscape:connector-curvature="0"
   style="fill:#0a9ec1"
   d="m 392.004,119.892 c -1.727,-4.841 -3.72,-9.582 -5.969,-14.203 l 14.383,-7 c 2.512,5.153 4.734,10.443 6.656,15.844 z"
   id="path20" />

	<path
   inkscape:connector-curvature="0"
   style="fill:#0a9ec1"
   d="m 378.531,92.251 c -2.757,-4.348 -5.743,-8.546 -8.945,-12.578 l 12.531,-9.953 c 3.558,4.482 6.875,9.15 9.938,13.984 z"
   id="path22" />

	<path
   inkscape:connector-curvature="0"
   style="fill:#0a9ec1"
   d="m 359.348,68.095 c -3.62,-3.679 -7.426,-7.171 -11.402,-10.461 l 10.195,-12.328 c 4.399,3.639 8.609,7.501 12.613,11.57 z"
   id="path24" />

	<path
   inkscape:connector-curvature="0"
   style="fill:#0a9ec1"
   d="m 335.52,48.345 c -4.25,-2.859 -8.723,-5.563 -13.293,-8.031 l 7.609,-14.078 c 5.023,2.719 9.938,5.688 14.613,8.828 z"
   id="path26" />

	<path
   inkscape:connector-curvature="0"
   style="fill:#0a9ec1"
   d="m 308.211,33.595 c -4.691,-1.992 -9.594,-3.805 -14.578,-5.383 l 4.844,-15.25 c 5.457,1.734 10.84,3.719 15.992,5.914 z"
   id="path28" />

	<path
   inkscape:connector-curvature="0"
   style="fill:#0a9ec1"
   d="m 278.586,24.173 c -5.023,-1.117 -10.188,-2.016 -15.348,-2.68 l 2.047,-15.875 c 5.633,0.734 11.273,1.719 16.762,2.93 z"
   id="path30" />

</g>
  <path
     inkscape:connector-curvature="0"
     style="fill:#2d8af9"
     d="M 305.951,451.72 H 174.049 c -8.837,0 -16,-7.163 -16,-16 v -0.561 c 0.097,-8.328 6.926,-15.001 15.254,-14.904 0.249,0.003 0.498,0.012 0.746,0.027 h 131.902 c 8.313,-0.509 15.464,5.818 15.973,14.131 0.015,0.249 0.024,0.497 0.027,0.746 v 0.561 c 0,8.837 -7.163,16 -16,16 z"
     id="path34" />
  <path
     inkscape:connector-curvature="0"
     style="fill:#086af9"
     d="m 172,451.72 h 136 c 8.837,0 16,7.163 16,16 v 0.56 c 0,8.837 -7.163,16 -16,16 H 172 c -8.837,0 -16,-7.163 -16,-16 v -0.56 c 0,-8.837 7.163,-16 16,-16 z"
     id="path36" />
  <path
     inkscape:connector-curvature="0"
     style="fill:#f4393d"
     d="m 240,131.72 v -48 c -4.562,0.028 -9.118,0.332 -13.643,0.913 l -3.51,16.703 c -5.18,0.944 -10.272,2.316 -15.225,4.103 L 196.157,92.64 c -8.36,3.603 -16.248,8.214 -23.489,13.731 l 5.303,16.146 c -4.022,3.412 -7.757,7.148 -11.169,11.17 l -16.147,-5.304 c -5.518,7.241 -10.129,15.13 -13.732,23.49 l 12.797,11.466 c -1.787,4.953 -3.159,10.046 -4.103,15.226 l -16.703,3.511 v 27.286 l 16.703,3.51 c 0.943,5.18 2.316,10.273 4.103,15.225 l -12.797,11.465 c 3.603,8.36 8.214,16.248 13.731,23.489 l 16.146,-5.303 c 3.412,4.022 7.148,7.757 11.17,11.169 l -5.304,16.147 c 7.241,5.518 15.13,10.13 23.491,13.733 L 207.623,286 c 4.953,1.787 10.046,3.16 15.226,4.104 l 3.511,16.703 c 4.525,0.58 9.081,0.885 13.643,0.913 v -48 c -35.346,0 -64,-28.654 -64,-64 0,-35.346 28.651,-64 63.997,-64 z"
     id="path38" />
  <path
     inkscape:connector-curvature="0"
     style="fill:#3ecced"
     d="m 376,195.72 c -10.137,0.031 -19.158,6.439 -22.526,16 H 312 v -32 h 40 c 4.417,0.001 7.999,-3.579 8,-7.996 0,-10e-4 0,-0.003 0,-0.004 v -33.474 c 12.497,-4.418 19.047,-18.13 14.629,-30.628 -4.418,-12.498 -18.13,-19.047 -30.628,-14.629 -12.497,4.418 -19.047,18.13 -14.629,30.628 2.416,6.835 7.793,12.212 14.628,14.629 v 25.475 h -32 v -16 H 296 V 98.246 c 12.497,-4.418 19.047,-18.13 14.629,-30.628 -4.418,-12.498 -18.13,-19.047 -30.628,-14.629 -12.497,4.418 -19.047,18.13 -14.629,30.628 2.416,6.835 7.793,12.212 14.628,14.629 v 49.475 h -40 v 96 h 24 v 32 c -10e-4,4.417 3.579,7.999 7.996,8 0.001,0 0.003,0 0.004,0 h 24 v 9.474 c -12.497,4.418 -19.046,18.131 -14.627,30.627 4.418,12.497 18.131,19.046 30.627,14.627 12.497,-4.418 19.046,-18.131 14.627,-30.627 -2.416,-6.835 -7.793,-12.211 -14.627,-14.627 V 275.72 c 10e-4,-4.417 -3.579,-7.999 -7.996,-8 -0.001,0 -0.003,0 -0.004,0 h -24 v -24 h 32 v -16 h 41.475 c 4.442,12.464 18.146,18.967 30.61,14.525 12.464,-4.442 18.967,-18.146 14.525,-30.61 -3.406,-9.557 -12.464,-15.933 -22.61,-15.915 z"
     id="path40" />
  <g
     id="g60">
</g>
  <g
     id="g62">
</g>
  <g
     id="g64">
</g>
  <g
     id="g66">
</g>
  <g
     id="g68">
</g>
  <g
     id="g70">
</g>
  <g
     id="g72">
</g>
  <g
     id="g74">
</g>
  <g
     id="g76">
</g>
  <g
     id="g78">
</g>
  <g
     id="g80">
</g>
  <g
     id="g82">
</g>
  <g
     id="g84">
</g>
  <g
     id="g86">
</g>
  <g
     id="g88">
</g>
</g>
</svg>
