"UF","Quantidade de gestantes e lactantes"
"AP",0
"MA",0
"RR",0
"SE",0
"PI",1
"AL",2
"BA",3
"TO",3
"AC",4
"AM",5
"PB",5
"RN",5
"MT",6
"RO",8
"GO",10
"RJ",10
"PA",15
"PE",15
"RS",16
"SC",16
"PR",17
"ES",22
"MS",32
"CE",35
"DF",37
"MG",48
"SP",177
