"Unidade da Federação","Percentual de Unidades da UF com visita"
"AC",90.91
"AL",90
"AM",94.74
"AP",85.71
"BA",92
"CE",90.62
"DF",100
"ES",100
"GO",89.09
"MA",98.08
"MG",99.57
"MS",100
"MT",92.31
"PA",100
"PB",93.24
"PE",84
"PI",100
"PR",86.76
"RJ",100
"RN",94.12
"RO",91.84
"RR",100
"RS",92.31
"SC",96.15
"SE",100
"SP",100
"TO",94.87
