"UF","Taxa de óbitos por 10 mil pessoas presas"
"AP",0
"MA",2.43
"RO",7.23
"AL",7.64
"AC",7.85
"MT",7.99
"RR",8.13
"DF",8.41
"CE",9.41
"SP",9.73
"ES",11.1
"PR",11.4
"MG",11.64
"BA",11.89
"TO",12.28
"SE",12.85
"PB",12.9
"PE",14.23
"SC",14.44
"GO",16.67
"RN",17.08
"PI",20.3
"RS",20.7
"MS",25.36
"AM",31.22
"RJ",36.2
"PA",49.81
