"UF";"população"
"AC";7
"AL";300
"AM";1272
"AP";0
"BA";2270
"CE";0
"DF";137
"ES";57
"GO";143
"MA";76
"MG";229
"MS";682
"MT";0
"PA";445
"PB";0
"PE";0
"PI";0
"PR";10196
"RJ";228
"RN";7
"RO";0
"RR";0
"RS";74
"SC";45
"SE";145
"SP";1827
"TO";0
