"UF";"população"
"AP";0
"RO";0
"TO";0
"RR";0
"PB";0
"MT";0
"PE";0
"PI";0
"CE";0
"RN";3
"AC";13
"SC";23
"MA";39
"ES";51
"RS";61
"GO";83
"MG";116
"DF";125
"SE";126
"AL";207
"RJ";233
"PA";445
"MS";567
"AM";1402
"BA";1820
"SP";2247
"PR";11323
