{
  "osu!": {
    "author": "Peppy",
    "type": "game",
    "repo": "",
    "url": "https://osu.ppy.sh",
    "img": "https://upload.wikimedia.org/wikipedia/commons/thumb/3/3c/Osu%21Logo_%282019%29.svg/1200px-Osu%21Logo_%282019%29.svg.png",
    "disc": "osu! - Rhythm is just a *click* away! With Ouendan/EBA, Taiko and original gameplay modes, as well as a fully functional level editor.",
    "version": "12.11.11 13.08.2020",
    "os": ["windows"],
    "tags": ["rhytm"]
  },
  "league of legends": {
    "author": "Riot Games",
    "type": "game",
    "repo": "",
    "url": "https://leagueoflegends.com",
    "img": "https://png2.kisspng.com/sh/ee1c23afd23ea8c3e0a030ffd74e81af/L0KzQYm3VMI3N5VriZH0aYP2gLBuTfxmaZh6fZ94Zj3vdbjsjvR0NZR0heJAdHX1PbrqjB50NZhmitd3YT35ebXsj71oaZ5qRd5uZ3XxdMS0VfFmOmM4S6luMkToRIa1UMc0PGo9UKI6NUK3R4eCVckyQWM8RuJ3Zx==/kisspng-league-of-legends-computer-icons-garena-video-game-legends-5ae22337e24e45.073498801524769591927.png",
    "disc": "League of Legends is a multiplayer online battle arena (MOBA) game in the three-dimensional isometric perspective.",
    "version": "12.11.11 13.08.2020",
    "os": ["windows"],
    "tags": ["lol", "moba"]
  }
}
