<?xml version="1.0" encoding="iso-8859-1"?>
<!-- Generator: Adobe Illustrator 19.0.0, SVG Export Plug-In . SVG Version: 6.00 Build 0)  -->
<svg version="1.1" id="Capa_1" xmlns="http://www.w3.org/2000/svg" xmlns:xlink="http://www.w3.org/1999/xlink" x="0px" y="0px"
	 viewBox="0 0 512 512" style="enable-background:new 0 0 512 512;" xml:space="preserve">
<polygon style="fill:#FF4F19;" points="506.352,494.499 406.283,494.499 406.283,333.387 476.331,292.358 506.352,292.358 "/>
<polygon style="fill:#EE2500;" points="506.352,292.358 476.331,292.358 456.317,304.081 456.317,494.499 506.352,494.499 "/>
<rect x="115.08" y="364.412" style="fill:#AEADB3;" width="30.021" height="130.09"/>
<rect x="130.09" y="364.412" style="fill:#57555C;" width="15.01" height="130.09"/>
<rect x="78.054" y="349.402" style="fill:#ECB300;" width="104.072" height="30.021"/>
<rect x="130.09" y="349.402" style="fill:#D9A500;" width="52.036" height="30.021"/>
<polygon style="fill:#A17852;" points="200.547,493.972 143.252,253.331 116.929,253.331 59.633,493.972 30.429,487.02 
	93.217,223.31 166.964,223.31 229.752,487.02 "/>
<polygon style="fill:#715539;" points="130.09,223.31 130.09,253.331 143.252,253.331 200.547,493.972 229.752,487.02 
	166.964,223.31 "/>
<path style="fill:#AEADB3;" d="M80.056,228.314H0v-80.056h80.056V228.314z"/>
<path style="fill:#57555C;" d="M260.181,228.314h-80.056v-80.056h80.056V228.314z"/>
<path style="fill:#FFDB2D;" d="M210.146,253.331H50.035v-130.09h160.111V253.331z"/>
<rect x="130.09" y="123.245" style="fill:#FEC000;" width="80.056" height="130.09"/>
<path style="fill:#C8AD92;" d="M399.339,362.712l-67.547-116.994c-8.688-15.046-10.995-32.575-6.499-49.357
	c4.496-16.783,15.26-30.809,30.306-39.495c31.059-17.933,70.919-7.253,88.854,23.809L512,297.668L399.339,362.712z"/>
<path style="fill:#B38A65;" d="M444.453,180.673c-17.934-31.061-57.795-41.742-88.854-23.809l100.07,173.326L512,297.667
	L444.453,180.673z"/>
<path style="fill:#FFDBA9;" d="M372.259,278.348H259.18v-80.056h113.079c22.071,0,40.028,17.956,40.028,40.028
	S394.33,278.348,372.259,278.348z"/>
<g>
	<path style="fill:#FFF5CB;" d="M379.951,199.042c-2.491-0.487-5.062-0.75-7.692-0.75H259.18v80.056h113.079
		c17.532,0,32.457-11.335,37.858-27.057L379.951,199.042z"/>
	<path style="fill:#FFF5CB;" d="M343.179,190.26c-4.78,0-9.593-0.628-14.334-1.898c-14.2-3.805-26.069-12.912-33.419-25.644
		L272.91,123.72l95.328-55.038l22.516,38.998c7.351,12.732,9.303,27.563,5.499,41.764c-3.806,14.2-12.912,26.069-25.644,33.419
		C362.129,187.758,352.716,190.26,343.179,190.26z"/>
</g>
<path style="fill:#FFDBA9;" d="M320.574,96.2l50.035,86.663c12.732-7.351,21.838-19.219,25.644-33.42
	c3.805-14.2,1.851-29.032-5.499-41.764l-22.516-38.998L320.574,96.2z"/>
<path style="fill:#FFDB2D;" d="M274.92,157.222l-20.014-34.665c-19.312-33.45-7.81-76.376,25.64-95.689
	c33.446-19.312,76.373-7.812,95.689,25.64l20.014,34.665L274.92,157.222z"/>
<path style="fill:#FEC000;" d="M376.236,52.509c-19.315-33.451-62.242-44.952-95.689-25.64l55.038,95.328l60.664-35.024
	L376.236,52.509z"/>
<polygon style="fill:#ECB300;" points="381.227,61.155 232.178,147.235 247.189,173.233 396.238,87.155 "/>
<polygon style="fill:#D9A500;" points="335.578,122.187 396.238,87.155 387.933,72.77 381.227,61.155 320.568,96.188 "/>
<g>
</g>
<g>
</g>
<g>
</g>
<g>
</g>
<g>
</g>
<g>
</g>
<g>
</g>
<g>
</g>
<g>
</g>
<g>
</g>
<g>
</g>
<g>
</g>
<g>
</g>
<g>
</g>
<g>
</g>
</svg>
