<?xml version="1.0" encoding="utf-8"?>
<!-- Generator: Adobe Illustrator 19.0.0, SVG Export Plug-In . SVG Version: 6.00 Build 0)  -->
<svg version="1.1" id="Layer_1" xmlns="http://www.w3.org/2000/svg" xmlns:xlink="http://www.w3.org/1999/xlink" x="0px" y="0px"
	 viewBox="0 0 107.5 107.5" style="enable-background:new 0 0 107.5 107.5;" xml:space="preserve">
<style type="text/css">
	.st0{fill:#5555FF;}
	.st1{fill:none;stroke:#5555FF;stroke-miterlimit:10;}
</style>
<g id="XMLID_3_">
	<g id="XMLID_7_">
		<polygon id="XMLID_9_" class="st0" points="53.7,8.2 53.9,8.4 95.4,80.4 54.1,80.4 53.8,80.1 33.1,44.2 33,44.2 		"/>
	</g>
	<g id="XMLID_8_">
		<polyline id="XMLID_12_" class="st1" points="53.9,8.4 95.4,80.4 54.1,80.4 		"/>
		<polyline id="XMLID_11_" class="st1" points="53.8,8.1 53.7,8.2 33,44.2 12.2,80.1 		"/>
		<line id="XMLID_10_" class="st1" x1="33.1" y1="44.2" x2="53.8" y2="80.1"/>
	</g>
</g>
<circle id="XMLID_832_" class="st1" cx="53.8" cy="53.8" r="53.3"/>
</svg>
