<?xml version="1.0" encoding="UTF-8"?>
<svg width="32px" height="32px" viewBox="0 0 32 32" version="1.1" xmlns="http://www.w3.org/2000/svg" xmlns:xlink="http://www.w3.org/1999/xlink">
    <!-- Generator: Sketch 58 (84663) - https://sketch.com -->
    <title>menu burger</title>
    <desc>Created with Sketch.</desc>
    <g id="venderlab" stroke="none" stroke-width="1" fill="none" fill-rule="evenodd">
        <g id="Menu" transform="translate(-1348.000000, -62.000000)" fill="#FFFFFF">
            <path d="M1380,90 L1380,94 L1376,94 L1376,90 L1380,90 Z M1352,90 L1352,94 L1348,94 L1348,90 L1352,90 Z M1366,76 L1366,80 L1362,80 L1362,76 L1366,76 Z M1380,62 L1380,66 L1376,66 L1376,62 L1380,62 Z M1352,62 L1352,66 L1348,66 L1348,62 L1352,62 Z" id="menu-burger"></path>
        </g>
    </g>
</svg>