<?xml version="1.0" encoding="UTF-8"?>
<svg width="25px" height="25px" viewBox="0 0 25 25" version="1.1" xmlns="http://www.w3.org/2000/svg" xmlns:xlink="http://www.w3.org/1999/xlink">
    <!-- Generator: Sketch 58 (84663) - https://sketch.com -->
    <title>Shape</title>
    <desc>Created with Sketch.</desc>
    <g id="venderlab" stroke="none" stroke-width="1" fill="none" fill-rule="evenodd">
        <g id="Экран-№5" transform="translate(-113.000000, -939.000000)" fill="#FFFFFF" fill-rule="nonzero">
            <g id="Group-5" transform="translate(60.000000, 289.000000)">
                <g id="Group-8" transform="translate(0.000000, 430.000000)">
                    <g id="Group-2-Copy" transform="translate(0.000000, 118.000000)">
                        <g id="Group">
                            <g id="whatsapp" transform="translate(53.000000, 102.000000)">
                                <path d="M12.4998093,24.802208 L12.4948501,24.802208 C10.5443955,24.801445 8.61053467,24.341011 6.87751768,23.4674454 L1.53541563,24.6826172 C1.20944976,24.7566223 0.868034375,24.6587753 0.630760205,24.4232178 C0.393486035,24.1876602 0.293350195,23.8470078 0.365066504,23.5204697 L1.52263643,18.2588577 C0.528144824,16.4222717 0.00305175781,14.4107818 7.10542736e-15,12.4162674 C7.10542736e-15,12.4094009 7.10542736e-15,12.4025345 7.10542736e-15,12.3958588 C0.00133514648,9.09061431 1.30844116,5.97782134 3.6802292,3.63101958 C6.04667666,1.2895584 9.17873384,-2.84217094e-14 12.4996186,-2.84217094e-14 C15.8279419,0.00133514648 18.95504,1.29203799 21.3058472,3.63407134 C23.68927,6.00872041 25.0011444,9.12399292 25,12.405777 C24.9990463,14.8859024 24.2553711,17.2828674 22.8494644,19.3372727 C22.5448608,19.7824478 21.9371796,19.8963165 21.4920044,19.5917129 C21.04702,19.2871094 20.9329605,18.6794281 21.2375641,18.2342529 C22.420311,16.5058136 23.0459213,14.4901275 23.046875,12.4050141 C23.0478287,9.64641572 21.9400406,7.02285767 19.9274063,5.01766206 C17.9450989,3.04260254 15.307045,1.95426943 12.4992371,1.953125 C6.69269561,1.953125 1.96533203,6.62803652 1.953125,12.3783111 C1.953125,12.3846054 1.95331572,12.3907089 1.95331572,12.3968125 C1.95255278,14.1767502 2.45323184,15.9814834 3.40099336,17.6158905 C3.52363584,17.8274155 3.5625458,18.0770874 3.50990293,18.3156967 L2.60334014,22.4365234 L6.79473877,21.4830398 C7.02610015,21.4305878 7.26871489,21.4639664 7.47737886,21.5770722 C9.00878906,22.4084854 10.7439041,22.84832 12.4952316,22.849083 L12.4996186,22.849083 C14.4041062,22.849083 16.2744522,22.3340988 17.9082871,21.3600159 C18.3713913,21.0836411 18.970871,21.2352753 19.2470551,21.6985703 C19.5232392,22.1618652 19.3717957,22.7611542 18.9085007,23.037529 C16.9723511,24.1918564 14.7562027,24.802208 12.4996186,24.802208 L12.4998093,24.802208 Z M9.74178315,7.43255615 C9.52758789,6.95800781 9.30213926,6.94179536 9.09843447,6.93359375 L8.55045317,6.93359375 C8.35971831,6.93359375 8.04996489,7.00492861 7.78808594,7.2900772 C7.52601621,7.57522583 6.7873001,8.2645416 6.7873001,9.66663359 C6.7873001,11.0687256 7.81192778,12.4237061 7.95478818,12.6140595 C8.09783936,12.8040313 9.93289946,15.773201 12.8389358,16.9155121 C15.2542114,17.8647995 15.7457352,17.675972 16.2698746,17.6282883 C16.7942047,17.580986 17.9616928,16.9391632 18.1997299,16.2736893 C18.4381485,15.6084061 18.4381485,15.0381088 18.3666229,14.9188995 C18.2952881,14.8002625 18.1045532,14.7289276 17.8186417,14.5864487 C17.5325394,14.4439697 16.1312104,13.7426376 15.8691406,13.6476517 C15.6070709,13.5526657 15.4165268,13.5051728 15.2257919,13.7905121 C15.0350571,14.07547 14.4735336,14.7344589 14.3066406,14.9244309 C14.1399384,15.114975 13.9730454,15.1386261 13.6871338,14.9961472 C13.4012222,14.853096 12.4897003,14.5469666 11.3973618,13.5763168 C10.5472564,12.820816 9.9575043,11.857605 9.79061128,11.5722656 C9.62371826,11.2873077 9.77268218,11.1328125 9.91611479,10.990715 C10.0444794,10.8631134 10.2182388,10.688591 10.36129,10.5222702 C10.5039597,10.3559494 10.5447769,10.2371216 10.6399536,10.0469589 C10.735321,9.85679629 10.6876373,9.69047549 10.6163025,9.54780576 C10.5447769,9.40532686 9.99584199,7.99598691 9.74159238,7.43255615" id="Shape"></path>
                            </g>
                        </g>
                    </g>
                </g>
            </g>
        </g>
    </g>
</svg>