<?xml version="1.0" encoding="UTF-8"?>
<svg width="100px" height="100px" viewBox="0 0 100 100" version="1.1" xmlns="http://www.w3.org/2000/svg" xmlns:xlink="http://www.w3.org/1999/xlink">
    <!-- Generator: Sketch 52.5 (67469) - http://www.bohemiancoding.com/sketch -->
    <title>Artboard</title>
    <desc>Created with Sketch.</desc>
    <g id="Artboard" stroke="none" stroke-width="1" fill="none" fill-rule="evenodd">
        <rect fill="#101010" x="0" y="0" width="100" height="100"></rect>
        <text id="vdl" font-family="Universe-Display, Universe" font-size="50" font-weight="normal" line-spacing="50" fill="#FFFFFF">
            <tspan x="14" y="75">vdl</tspan>
        </text>
    </g>
</svg>