<?xml version="1.0" encoding="UTF-8"?>
<svg width="30px" height="21px" viewBox="0 0 30 21" version="1.1" xmlns="http://www.w3.org/2000/svg" xmlns:xlink="http://www.w3.org/1999/xlink">
    <!-- Generator: Sketch 59 (86127) - https://sketch.com -->
    <title>russia</title>
    <desc>Created with Sketch.</desc>
    <g id="Unidraft" stroke="none" stroke-width="1" fill="none" fill-rule="evenodd">
        <g id="Меню" transform="translate(-669.000000, -76.000000)">
            <g id="Group-2" transform="translate(0.000000, -4.000000)">
                <g id="Group-6" transform="translate(582.000000, 74.000000)">
                    <g id="Group-5-Copy" transform="translate(87.000000, 0.000000)">
                        <g id="russia" transform="translate(0.000000, 6.000000)">
                            <path d="M1.65535714,0.0321428571 L27.975,0.0321428571 C28.8696429,0.0321428571 29.5982143,0.760714286 29.5982143,1.65535714 L29.5982143,10.3178571 L0.0321428571,10.3178571 L0.0321428571,1.65535714 C0.0321428571,0.760714286 0.760714286,0.0321428571 1.65535714,0.0321428571 L1.65535714,0.0321428571 Z" id="Path" fill="#F5F5F5" fill-rule="nonzero"></path>
                            <path d="M0.0321428571,10.3178571 L29.6035714,10.3178571 L29.6035714,18.9803571 C29.6035714,19.875 28.875,20.6035714 27.9803571,20.6035714 L1.65535714,20.6035714 C0.760714286,20.6035714 0.0321428571,19.8696429 0.0321428571,18.9803571 L0.0321428571,10.3178571 L0.0321428571,10.3178571 Z" id="Path" fill="#D52B1E" fill-rule="nonzero"></path>
                            <polygon id="Path" fill="#0039A6" fill-rule="nonzero" points="0.0321428571 6.88928571 29.6035714 6.88928571 29.6035714 13.7464286 0.0321428571 13.7464286"></polygon>
                            <path d="M1.65535714,0.0321428571 L27.975,0.0321428571 C28.8696429,0.0321428571 29.5982143,0.760714286 29.5982143,1.65535714 L29.5982143,18.975 C29.5982143,19.8696429 28.8696429,20.5982143 27.975,20.5982143 L1.65535714,20.5982143 C0.760714286,20.5982143 0.0321428571,19.8642857 0.0321428571,18.975 L0.0321428571,1.65535714 C0.0321428571,0.760714286 0.760714286,0.0321428571 1.65535714,0.0321428571 L1.65535714,0.0321428571 Z" id="Path"></path>
                        </g>
                    </g>
                </g>
            </g>
        </g>
    </g>
</svg>