{
  "id": "62167eeeef22e00ff89b9148",
  "title": "Главный специалист Ведущий Инженер ОВиК",
  "description": "<h3>Описание вакансии</h3><p>Мы разрабатываем проекты для объектов коммерческой недвижимости на всех стадиях проектирования, от Концепции и Проектной документации до Тендерной и Рабочей документации, а также оказываем услуги Авторского надзора.<br /><br />Системный подход к управлению проектами, понимание специфики реализации проектов на территории РФ и профессиональная команда позволяют нам воплощать в жизнь самые сложные проекты.</p><h3>Требования</h3><ul><li>Высшее техническое образование</li><li>Опыт работы по специальности от 7 / 3 / 1 лет /года</li><li>Знание программ: MS Office (Word, Excel), AutoCAD</li><li>Опыт работы в Autodesk Revit от 1 года (обязательно)</li></ul><h3>Обязанности</h3><ul><li>Разработка раздела &laquo;Отопление, вентиляция и кондиционирование&raquo; на всех стадиях проектирования</li><li>Сбор исходных данных для разработки раздела</li><li>Разработка технических и технологических задании</li><li>Выполнение необходимых для проектирования расчетов</li><li>Подбор оборудования и составление спецификаций</li><li>Соблюдение высокого качества разрабатываемых проектов и обеспечение соответствия документации требованиям законодательства и нормативно-технической базы</li><li>Управление проектной группой (для Главных специалистов</li><li>Выполнение чертежей в Revit и AutoCAD</li><li>Прохождение экспертизы</li><li>Авторский надзор</li></ul><h3>Мы предлагаем</h3><ul><li>Оформление по ТК РФ</li><li>Своевременная выплата &laquo;белой&raquo; заработной платы</li><li>Уровень заработной платы оговаривается индивидуально с успешным кандидатом</li><li>Испытательный срок 3 месяца по ТК РФ</li><li>Гибкое начало рабочего дня</li><li>График 5/2</li><li>Классный офис - м. Савеловская/м.Дмитровская</li><li>Обучение программе Revit внутри компании</li><li>Интересные проекты</li><li>Возможность карьерного роста внутри компании</li></ul>",
  "isDemanded": true,
  "meta": {
    "metaTitle": "Главный специалист Ведущий Инженер ОВиК",
    "metaDescription": "Главный специалист Ведущий Инженер ОВиК",
    "metaCase": "string"
  }
}