{
  "companyBlocks": [
    {
      "id": "622476b7a503f2b35b328152",
      "positionIndex": 0,
      "title": "Компания",
      "subtitle": "",
      "text": "<p>Мы стремимся стать экспертами в сфере разработки проектов за счет применения как собственных разработок, основанных на нашем опыте и всестороннем анализе проектов, так и лучших мировых практик.</p><p>Мы разрабатываем эффективные комплексные решения, обеспечивающие комфорт и функциональность наших проектов без ущерба эстетике и экономичности.</p>",
      "imagePositionReverse": false,
      "images": [
        {
          "id": "622a5804f61e56f29d95fc02",
          "width": 515,
          "height": 624
        },
        {
          "id": "622a591bf61e56f29d95fc6a",
          "width": 789,
          "height": 527
        },
        {
          "id": "622a5990f61e56f29d95fc9a",
          "width": 869,
          "height": 580
        }
      ],
      "urls": [
        {
          "url": "https://unidraft.ru/vacancy",
          "label": "Подробнее",
          "isFile": false
        }
      ]
    },
    {
      "id": "622476b7a503f2b35b328153",
      "positionIndex": 1,
      "title": "Услуги",
      "subtitle": "",
      "text": "<p>Наша специализация – разработка проектов для объектов жилой и коммерческой недвижимости, таких как административно-офисные, гостиничные и многофункциональные комплексы, торгово-развлекательные и спортивные центры, и других.</p><p>Мы участвуем в реализации проекта на всех стадиях проектирования, начиная с концептуальных решений до выпуска Проектной, Тендерной и Рабочей документации, заканчивая ведением авторского надзора.</p><p>В наших проектах мы применяем лучшие российские и международные практики, а также учитываем требования экологических стандартов (LEED, BREEAM).</p>",
      "imagePositionReverse": false,
      "images": [],
      "urls": [
        {
          "url": "api/file/622476b7a503f2b35b32810e",
          "label": "Заключение по аудиту",
          "isFile": true
        },
        {
          "url": "https://example.com/",
          "label": "Подробнее",
          "isFile": false
        }
      ]
    },
    {
      "id": "622476b7a503f2b35b328154",
      "positionIndex": 2,
      "title": "BIM",
      "subtitle": "Building Information Modelling",
      "text": "<p>Мы используем информационное моделирование как основу процессов, связанных с формированием документации. Высокий уровень компетенций наших специалистов в области BIM подтверждён ведущими экспертами России и Великобритании.</p><p>По результатам аудита, проведенного компаниями ООО «Конкуратор» и AEC3 Ltd., итоговый индекс зрелости технологии BIM в Юнидрафт составляет 68%, что свидетельствует о высоких BIM-компетенциях международного уровня.</p>",
      "imagePositionReverse": true,
      "images": [
        {
          "id": "622b6f6aad369662d2c3753e",
          "width": 517,
          "height": 684
        },
        {
          "id": "622b6f85ad369662d2c37550",
          "width": 869,
          "height": 580
        },
        {
          "id": "622b6fa7ad369662d2c3755c",
          "width": 373,
          "height": 482
        }
      ],
      "urls": [
        {
          "url": "api/file/622a5ab6f61e56f29d95fcc9",
          "label": "Заключение по аудиту",
          "isFile": true
        }
      ]
    }
  ]
}