{
  "Mod": 69,
  "Pl": 5,
  "SelectionVer": "v11.manual",
  "XiID": 22381499289376,
  "CandID": 0,
  "Unixtime": 1531309424,
  "Time": "20180711T204344",
  "SensorWidth": -0.1365,
  "SensorHeight": 0.1173,
  "SensorPixelX": 512,
  "SensorPixelY": 440,
  "StageName": "NLAB-STAGE03",
  "AffineS2G": [
    0.99580774934124994,
    -0.0074008547040707679,
    0.0091180729605743853,
    0.99549666124143854,
    0.094223498095720212,
    -0.036610299831171117
  ],
  "AffineG2D": [
    0.99961678843075985,
    -0.00038643891764001954,
    0.00024987084045242089,
    0.99961326671769235,
    0.43810526429944019,
    -9.7611235551086413
  ],
  "FollowingStatus": "Through",
  "StopStatus": "",
  "Auger": false,
  "OperatorName": "Automaton",
  "Through": 1,
  "Boundaries": [
    0.0108,
    -0.2692,
    -0.31420000000000003,
    -0.58819999999999928
  ],
  "Patternmatch": {
    "NTrackPreviousDown": 540,
    "NTrackCurrentUp": 130,
    "CorrectionX": 0.0010000000000000009,
    "CorrectionY": -0.048999999999999988,
    "PeakEntry": 107,
    "EntryAverage": 35.213821411132812,
    "SignificanceSigma": 6.0196318626403809
  },
  "Prediction": {
    "ph": 0.0,
    "phv": 0.0,
    "px0": 0.0,
    "py0": 0.0,
    "pz0": 0.0,
    "px1": 0.0,
    "py1": 0.0,
    "pz1": 0.0,
    "searchmode": 0,
    "stratum": 0,
    "x0": 124.68972018895587,
    "y0": -103.62971326783475,
    "z0": 0.11080000000000001,
    "x1": 124.69960018895587,
    "y1": -103.64852326783475,
    "z1": 0.0108,
    "shrink": 1.0
  },
  "ConnectedSegments": [
    {
      "ph": 10.0,
      "phv": 222.0,
      "px0": -5.8906747536012123,
      "py0": -0.05852918877937574,
      "pz0": 0.0,
      "px1": -4.8274450341167547,
      "py1": -3.3628506444275943,
      "pz1": 9.0,
      "searchmode": 0,
      "stratum": 10,
      "x0": 124.70142873374124,
      "y0": -103.64945605438005,
      "z0": 0.010700000000000001,
      "x1": 124.70614527503673,
      "y1": -103.65933695644084,
      "z1": -0.016900000000000002,
      "shrink": 1.9
    },
    {
      "ph": 10.0,
      "phv": 348.0,
      "px0": 2.9629068887206658,
      "py0": 1.0501135503406518,
      "pz0": 0.0,
      "px1": -2.5892505677517037,
      "py1": -10.567751703255109,
      "pz1": 9.0,
      "searchmode": 0,
      "stratum": 8,
      "x0": 124.7059501913205,
      "y0": -103.66026865790379,
      "z0": -0.016900000000000005,
      "x1": 124.71143040517363,
      "y1": -103.67336587516344,
      "z1": -0.0448,
      "shrink": 1.9
    },
    {
      "ph": 10.0,
      "phv": 209.0,
      "px0": 1.5445608035904996,
      "py0": 1.6866851891429802,
      "pz0": 0.0,
      "px1": -6.7905535370805836,
      "py1": -3.0194486001282312,
      "pz1": 9.0,
      "searchmode": 0,
      "stratum": 8,
      "x0": 124.71169929492982,
      "y0": -103.67317765130467,
      "z0": -0.044800000000000006,
      "x1": 124.71892144943666,
      "y1": -103.68743226378986,
      "z1": -0.0721,
      "shrink": 1.9
    },
    {
      "ph": 10.0,
      "phv": 316.0,
      "px0": -0.26379366634020163,
      "py0": 1.1323321362498631,
      "pz0": 0.0,
      "px1": -3.0053324627271865,
      "py1": 0.81847861573620551,
      "pz1": 9.0,
      "searchmode": 0,
      "stratum": 8,
      "x0": 124.719435777067,
      "y0": -103.68673996579409,
      "z0": -0.0721,
      "x1": 124.72716667559378,
      "y1": -103.70082363628944,
      "z1": -0.09920000000000001,
      "shrink": 1.9
    },
    {
      "ph": 10.0,
      "phv": 286.0,
      "px0": -2.6557482337829112,
      "py0": -0.46679511881824587,
      "pz0": 0.0,
      "px1": 1.4351958895311539,
      "py1": -1.613615928066801,
      "pz1": 9.0,
      "searchmode": 0,
      "stratum": 8,
      "x0": 124.72716270058105,
      "y0": -103.70127730933614,
      "z0": -0.09920000000000001,
      "x1": 124.73407204848566,
      "y1": -103.71558304133824,
      "z1": -0.1263,
      "shrink": 1.9
    },
    {
      "ph": 10.0,
      "phv": 249.0,
      "px0": 1.4404313368844863,
      "py0": 0.50526179030792817,
      "pz0": 0.0,
      "px1": -2.9456931271924272,
      "py1": -1.6389502403533685,
      "pz1": 9.0,
      "searchmode": 0,
      "stratum": 8,
      "x0": 124.73520065257264,
      "y0": -103.71515111551726,
      "z0": -0.12629999999999997,
      "x1": 124.74137000020809,
      "y1": -103.73072274295178,
      "z1": -0.1532,
      "shrink": 1.9
    },
    {
      "ph": 10.0,
      "phv": 226.0,
      "px0": -0.72715489306546521,
      "py0": 2.1215165262475595,
      "pz0": 0.0,
      "px1": -5.8470511989630669,
      "py1": 2.0463383020090631,
      "pz1": 9.0,
      "searchmode": 0,
      "stratum": 8,
      "x0": 124.74187634680817,
      "y0": -103.7294444438962,
      "z0": -0.1532,
      "x1": 124.74924131916316,
      "y1": -103.74546448572733,
      "z1": -0.18000000000000005,
      "shrink": 1.9
    },
    {
      "ph": 8.0,
      "phv": 96.0,
      "px0": 6.9891196834817331,
      "py0": -7.6439169139465672,
      "pz0": 0.0,
      "px1": -6.7695351137487316,
      "py1": -1.0306627101879129,
      "pz1": 9.0,
      "searchmode": 0,
      "stratum": 9,
      "x0": 124.7489707292053,
      "y0": -103.74715628203398,
      "z0": -0.1801,
      "x1": 124.75963880807214,
      "y1": -103.76039324858377,
      "z1": -0.2068,
      "shrink": 1.9
    },
    {
      "ph": 8.0,
      "phv": 105.0,
      "px0": -1.5478065241845114,
      "py0": -10.613892013498329,
      "pz0": 0.0,
      "px1": 6.8515185601799429,
      "py1": -18.483408323959523,
      "pz1": 9.0,
      "searchmode": 0,
      "stratum": 9,
      "x0": 124.75929301104208,
      "y0": -103.76487853787452,
      "z0": -0.20679999999999998,
      "x1": 124.76705373785063,
      "y1": -103.77997647938184,
      "z1": -0.2338,
      "shrink": 1.9
    },
    {
      "ph": 7.0,
      "phv": 38.0,
      "px0": -11.615015974440912,
      "py0": 2.8242811501597291,
      "pz0": 0.0,
      "px1": -3.8067092651757366,
      "py1": -5.8785942492012939,
      "pz1": 9.0,
      "searchmode": 0,
      "stratum": 9,
      "x0": 124.77005572802266,
      "y0": -103.78040712605285,
      "z0": -0.2338,
      "x1": 124.77397402125349,
      "y1": -103.79772723351728,
      "z1": -0.2606,
      "shrink": 1.9
    },
    {
      "ph": 7.0,
      "phv": 22.0,
      "px0": -45.976470588235273,
      "py0": -34.547058823529412,
      "pz0": 0.0,
      "px1": -73.95294117647056,
      "py1": -8.8294117647058812,
      "pz1": 9.0,
      "searchmode": 0,
      "stratum": 15,
      "x0": 124.79498668428309,
      "y0": -103.82478188636364,
      "z0": -0.3145,
      "x1": 124.80644525505517,
      "y1": -103.83392579545455,
      "z1": -0.3409,
      "shrink": 1.9
    },
    {
      "ph": 10.0,
      "phv": 256.0,
      "px0": 7.3212149102623449,
      "py0": -16.109756097560961,
      "pz0": 0.0,
      "px1": -0.46065347445923832,
      "py1": -41.615508513575691,
      "pz1": 9.0,
      "searchmode": 1,
      "stratum": 13,
      "x0": 124.80608548180079,
      "y0": -103.8416945153851,
      "z0": -0.341,
      "x1": 124.81716014007132,
      "y1": -103.85549411710873,
      "z1": -0.3635,
      "shrink": 1.9
    },
    {
      "ph": 10.0,
      "phv": 340.0,
      "px0": -6.2202663055743379,
      "py0": 3.1861882193635531,
      "pz0": 0.0,
      "px1": 2.4026179192056212,
      "py1": -3.0029338749718115,
      "pz1": 9.0,
      "searchmode": 0,
      "stratum": 13,
      "x0": 124.81750889551243,
      "y0": -103.85497557302888,
      "z0": -0.3635,
      "x1": 124.82821002110485,
      "y1": -103.87362553671447,
      "z1": -0.3896,
      "shrink": 1.9
    },
    {
      "ph": 10.0,
      "phv": 326.0,
      "px0": -8.8369696969697209,
      "py0": 1.0843636363636175,
      "pz0": 0.0,
      "px1": 1.4389090909090676,
      "py1": 8.6693333333333147,
      "pz1": 9.0,
      "searchmode": 0,
      "stratum": 13,
      "x0": 124.82898616725852,
      "y0": -103.87269987652893,
      "z0": -0.3896,
      "x1": 124.83724660191761,
      "y1": -103.88867779256198,
      "z1": -0.4156,
      "shrink": 1.9
    },
    {
      "ph": 10.0,
      "phv": 336.0,
      "px0": 1.39874739039666,
      "py0": -0.664832036439547,
      "pz0": 0.0,
      "px1": -5.5323590814196235,
      "py1": -3.2247105712658897,
      "pz1": 9.0,
      "searchmode": 0,
      "stratum": 12,
      "x0": 124.8385510136678,
      "y0": -103.88951845834987,
      "z0": -0.41570000000000007,
      "x1": 124.84739885748303,
      "y1": -103.90720089869564,
      "z1": -0.44210000000000005,
      "shrink": 1.9
    },
    {
      "ph": 10.0,
      "phv": 459.0,
      "px0": -0.428112614459482,
      "py0": -0.40241902419023434,
      "pz0": 0.0,
      "px1": -0.91875085417521252,
      "py1": 4.0182451824518317,
      "pz1": 9.0,
      "searchmode": 0,
      "stratum": 12,
      "x0": 124.84717953795261,
      "y0": -103.90651802680867,
      "z0": -0.44220000000000004,
      "x1": 124.85631034287395,
      "y1": -103.92333951791903,
      "z1": -0.46830000000000005,
      "shrink": 1.9
    },
    {
      "ph": 10.0,
      "phv": 335.0,
      "px0": -5.19962335216571,
      "py0": -0.62643382982366913,
      "pz0": 0.0,
      "px1": -0.24362266735146587,
      "py1": -0.22889916110255973,
      "pz1": 9.0,
      "searchmode": 0,
      "stratum": 12,
      "x0": 124.85672558894693,
      "y0": -103.92411401199982,
      "z0": -0.46830000000000005,
      "x1": 124.86440431142061,
      "y1": -103.94000803287108,
      "z1": -0.49460000000000004,
      "shrink": 1.9
    },
    {
      "ph": 10.0,
      "phv": 424.0,
      "px0": 0.49200443318557086,
      "py0": -0.74509183027231352,
      "pz0": 0.0,
      "px1": -2.7467542748574942,
      "py1": -4.9759341355288047,
      "pz1": 9.0,
      "searchmode": 0,
      "stratum": 12,
      "x0": 124.86530055991544,
      "y0": -103.94076258675658,
      "z0": -0.49460000000000004,
      "x1": 124.87316401804755,
      "y1": -103.95789049085296,
      "z1": -0.5213,
      "shrink": 1.9
    },
    {
      "ph": 10.0,
      "phv": 432.0,
      "px0": 2.2035716806663155,
      "py0": -0.85614456130443983,
      "pz0": 0.0,
      "px1": -1.3345097762405809,
      "py1": -4.9287075598221222,
      "pz1": 9.0,
      "searchmode": 0,
      "stratum": 12,
      "x0": 124.8728841533692,
      "y0": -103.95877109449296,
      "z0": -0.52140000000000009,
      "x1": 124.88182741141387,
      "y1": -103.97685680276507,
      "z1": -0.5479,
      "shrink": 1.9
    },
    {
      "ph": 10.0,
      "phv": 438.0,
      "px0": 1.1335850056295329,
      "py0": 0.24889065501027274,
      "pz0": 0.0,
      "px1": 1.8750910656335065,
      "py1": 1.3512153122723432,
      "pz1": 9.0,
      "searchmode": 0,
      "stratum": 12,
      "x0": 124.88159894112917,
      "y0": -103.97578671314777,
      "z0": -0.5479,
      "x1": 124.89360020933638,
      "y1": -104.00455988298671,
      "z1": -0.58819999999999928,
      "shrink": 1.9
    }
  ],
  "AllSegments": [
    [
      {
        "ph": 10.0,
        "phv": 222.0,
        "px0": -5.8906747536012123,
        "py0": -0.05852918877937574,
        "pz0": 0.0,
        "px1": -4.8274450341167547,
        "py1": -3.3628506444275943,
        "pz1": 9.0,
        "searchmode": 0,
        "stratum": 10,
        "x0": 124.70142873374124,
        "y0": -103.64945605438005,
        "z0": 0.010700000000000001,
        "x1": 124.70614527503673,
        "y1": -103.65933695644084,
        "z1": -0.016900000000000002,
        "shrink": 1.9
      },
      {
        "ph": 6.0,
        "phv": 2.0,
        "px0": 20.0,
        "py0": 63.5,
        "pz0": 0.0,
        "px1": 16.0,
        "py1": 55.5,
        "pz1": 9.0,
        "searchmode": 0,
        "stratum": 10,
        "x0": 124.695201171875,
        "y0": -103.6331378409091,
        "z0": 0.010700000000000001,
        "x1": 124.701267578125,
        "y1": -103.64427056818182,
        "z1": -0.016900000000000002,
        "shrink": 1.9
      },
      {
        "ph": 6.0,
        "phv": 1.0,
        "px0": 84.0,
        "py0": 73.0,
        "pz0": 0.0,
        "px1": 60.0,
        "py1": 73.0,
        "pz1": 9.0,
        "searchmode": 0,
        "stratum": 10,
        "x0": 124.6808046875,
        "y0": -103.62953886363638,
        "z0": 0.010700000000000001,
        "x1": 124.69220312499999,
        "y1": -103.63853886363637,
        "z1": -0.016900000000000002,
        "shrink": 1.9
      }
    ],
    [
      {
        "ph": 10.0,
        "phv": 348.0,
        "px0": 2.9629068887206658,
        "py0": 1.0501135503406518,
        "pz0": 0.0,
        "px1": -2.5892505677517037,
        "py1": -10.567751703255109,
        "pz1": 9.0,
        "searchmode": 0,
        "stratum": 8,
        "x0": 124.7059501913205,
        "y0": -103.66026865790379,
        "z0": -0.016900000000000005,
        "x1": 124.71143040517363,
        "y1": -103.67336587516344,
        "z1": -0.0448,
        "shrink": 1.9
      },
      {
        "ph": 6.0,
        "phv": 7.0,
        "px0": 0.357142857142841,
        "py0": 36.928571428571409,
        "pz0": 0.0,
        "px1": -2.2142857142857304,
        "py1": 51.2142857142857,
        "pz1": 9.0,
        "searchmode": 0,
        "stratum": 8,
        "x0": 124.70624755859375,
        "y0": -103.64725095779222,
        "z0": -0.016900000000000005,
        "x1": 124.71093310546875,
        "y1": -103.65344251623377,
        "z1": -0.0448,
        "shrink": 1.9
      },
      {
        "ph": 6.0,
        "phv": 2.0,
        "px0": -94.5,
        "py0": -13.0,
        "pz0": 0.0,
        "px1": -74.5,
        "py1": -13.0,
        "pz1": 9.0,
        "searchmode": 0,
        "stratum": 8,
        "x0": 124.72852783203125,
        "y0": -103.66246568181819,
        "z0": -0.016900000000000005,
        "x1": 124.72719580078125,
        "y1": -103.67246568181818,
        "z1": -0.0448,
        "shrink": 1.9
      },
      {
        "ph": 6.0,
        "phv": 1.0,
        "px0": 66.0,
        "py0": 13.0,
        "pz0": 0.0,
        "px1": 58.0,
        "py1": 13.0,
        "pz1": 9.0,
        "searchmode": 0,
        "stratum": 8,
        "x0": 124.689470703125,
        "y0": -103.65553431818182,
        "z0": -0.016900000000000005,
        "x1": 124.695603515625,
        "y1": -103.66553431818181,
        "z1": -0.0448,
        "shrink": 1.9
      }
    ],
    [
      {
        "ph": 10.0,
        "phv": 209.0,
        "px0": 1.5445608035904996,
        "py0": 1.6866851891429802,
        "pz0": 0.0,
        "px1": -6.7905535370805836,
        "py1": -3.0194486001282312,
        "pz1": 9.0,
        "searchmode": 0,
        "stratum": 8,
        "x0": 124.71169929492982,
        "y0": -103.67317765130467,
        "z0": -0.044800000000000006,
        "x1": 124.71892144943666,
        "y1": -103.68743226378986,
        "z1": -0.0721,
        "shrink": 1.9
      }
    ],
    [
      {
        "ph": 10.0,
        "phv": 316.0,
        "px0": -0.26379366634020163,
        "py0": 1.1323321362498631,
        "pz0": 0.0,
        "px1": -3.0053324627271865,
        "py1": 0.81847861573620551,
        "pz1": 9.0,
        "searchmode": 0,
        "stratum": 8,
        "x0": 124.719435777067,
        "y0": -103.68673996579409,
        "z0": -0.0721,
        "x1": 124.72716667559378,
        "y1": -103.70082363628944,
        "z1": -0.09920000000000001,
        "shrink": 1.9
      }
    ],
    [
      {
        "ph": 10.0,
        "phv": 286.0,
        "px0": -2.6557482337829112,
        "py0": -0.46679511881824587,
        "pz0": 0.0,
        "px1": 1.4351958895311539,
        "py1": -1.613615928066801,
        "pz1": 9.0,
        "searchmode": 0,
        "stratum": 8,
        "x0": 124.72716270058105,
        "y0": -103.70127730933614,
        "z0": -0.09920000000000001,
        "x1": 124.73407204848566,
        "y1": -103.71558304133824,
        "z1": -0.1263,
        "shrink": 1.9
      }
    ],
    [
      {
        "ph": 10.0,
        "phv": 249.0,
        "px0": 1.4404313368844863,
        "py0": 0.50526179030792817,
        "pz0": 0.0,
        "px1": -2.9456931271924272,
        "py1": -1.6389502403533685,
        "pz1": 9.0,
        "searchmode": 0,
        "stratum": 8,
        "x0": 124.73520065257264,
        "y0": -103.71515111551726,
        "z0": -0.12629999999999997,
        "x1": 124.74137000020809,
        "y1": -103.73072274295178,
        "z1": -0.1532,
        "shrink": 1.9
      }
    ],
    [
      {
        "ph": 10.0,
        "phv": 226.0,
        "px0": -0.72715489306546521,
        "py0": 2.1215165262475595,
        "pz0": 0.0,
        "px1": -5.8470511989630669,
        "py1": 2.0463383020090631,
        "pz1": 9.0,
        "searchmode": 0,
        "stratum": 8,
        "x0": 124.74187634680817,
        "y0": -103.7294444438962,
        "z0": -0.1532,
        "x1": 124.74924131916316,
        "y1": -103.74546448572733,
        "z1": -0.18000000000000005,
        "shrink": 1.9
      }
    ],
    [
      {
        "ph": 8.0,
        "phv": 96.0,
        "px0": 6.9891196834817331,
        "py0": -7.6439169139465672,
        "pz0": 0.0,
        "px1": -6.7695351137487316,
        "py1": -1.0306627101879129,
        "pz1": 9.0,
        "searchmode": 0,
        "stratum": 9,
        "x0": 124.7489707292053,
        "y0": -103.74715628203398,
        "z0": -0.1801,
        "x1": 124.75963880807214,
        "y1": -103.76039324858377,
        "z1": -0.2068,
        "shrink": 1.9
      },
      {
        "ph": 6.0,
        "phv": 9.0,
        "px0": -6.071428571428604,
        "py0": -1.8571428571428572,
        "pz0": 0.0,
        "px1": 1.3571428571428248,
        "py1": -2.1428571428571428,
        "pz1": 9.0,
        "searchmode": 0,
        "stratum": 9,
        "x0": 124.74962841796875,
        "y0": -103.74653318181818,
        "z0": -0.1801,
        "x1": 124.75464794921874,
        "y1": -103.76160935064935,
        "z1": -0.2068,
        "shrink": 1.9
      }
    ],
    [
      {
        "ph": 8.0,
        "phv": 105.0,
        "px0": -1.5478065241845114,
        "py0": -10.613892013498329,
        "pz0": 0.0,
        "px1": 6.8515185601799429,
        "py1": -18.483408323959523,
        "pz1": 9.0,
        "searchmode": 0,
        "stratum": 9,
        "x0": 124.75929301104208,
        "y0": -103.76487853787452,
        "z0": -0.20679999999999998,
        "x1": 124.76705373785063,
        "y1": -103.77997647938184,
        "z1": -0.2338,
        "shrink": 1.9
      },
      {
        "ph": 6.0,
        "phv": 15.0,
        "px0": 18.95999999999998,
        "py0": -33.493333333333339,
        "pz0": 0.0,
        "px1": 9.3333333333333144,
        "py1": -23.306666666666672,
        "pz1": 9.0,
        "searchmode": 0,
        "stratum": 9,
        "x0": 124.75622847656251,
        "y0": -103.76857118181817,
        "z0": -0.20679999999999998,
        "x1": 124.7687949609375,
        "y1": -103.7788555090909,
        "z1": -0.2338,
        "shrink": 1.9
      }
    ],
    [
      {
        "ph": 7.0,
        "phv": 38.0,
        "px0": -11.615015974440912,
        "py0": 2.8242811501597291,
        "pz0": 0.0,
        "px1": -3.8067092651757366,
        "py1": -5.8785942492012939,
        "pz1": 9.0,
        "searchmode": 0,
        "stratum": 9,
        "x0": 124.77005572802266,
        "y0": -103.78040712605285,
        "z0": -0.2338,
        "x1": 124.77397402125349,
        "y1": -103.79772723351728,
        "z1": -0.2606,
        "shrink": 1.9
      },
      {
        "ph": 6.0,
        "phv": 9.0,
        "px0": 8.5625,
        "py0": -16.90625,
        "pz0": 0.0,
        "px1": -3.4375,
        "py1": -13.90625,
        "pz1": 9.0,
        "searchmode": 0,
        "stratum": 9,
        "x0": 124.76731683349608,
        "y0": -103.78410716619317,
        "z0": -0.2338,
        "x1": 124.7765160522461,
        "y1": -103.79830739346591,
        "z1": -0.2606,
        "shrink": 1.9
      },
      {
        "ph": 6.0,
        "phv": 1.0,
        "px0": 0.0,
        "py0": -6.0,
        "pz0": 0.0,
        "px1": -8.0,
        "py1": 6.0,
        "pz1": 9.0,
        "searchmode": 0,
        "stratum": 9,
        "x0": 124.76906640624999,
        "y0": -103.78,
        "z0": -0.2338,
        "x1": 124.77719921875,
        "y1": -103.79180090909091,
        "z1": -0.2606,
        "shrink": 1.9
      }
    ],
    [
      {
        "ph": 7.0,
        "phv": 95.0,
        "px0": -72.20456466610311,
        "py0": -21.105945336714548,
        "pz0": 0.0,
        "px1": -75.423499577345709,
        "py1": -16.382361228515059,
        "pz1": 9.0,
        "searchmode": 0,
        "stratum": 15,
        "x0": 124.79867893629807,
        "y0": -103.82399702086374,
        "z0": -0.3145,
        "x1": 124.80353710937501,
        "y1": -103.83873775628217,
        "z1": -0.3409,
        "shrink": 1.9
      },
      {
        "ph": 7.0,
        "phv": 22.0,
        "px0": -45.976470588235273,
        "py0": -34.547058823529412,
        "pz0": 0.0,
        "px1": -73.95294117647056,
        "py1": -8.8294117647058812,
        "pz1": 9.0,
        "searchmode": 0,
        "stratum": 15,
        "x0": 124.79498668428309,
        "y0": -103.82478188636364,
        "z0": -0.3145,
        "x1": 124.80644525505517,
        "y1": -103.83392579545455,
        "z1": -0.3409,
        "shrink": 1.9
      },
      {
        "ph": 6.0,
        "phv": 21.0,
        "px0": -100.88321167883211,
        "py0": -28.766423357664245,
        "pz0": 0.0,
        "px1": -76.532846715328475,
        "py1": -17.408759124087602,
        "pz1": 9.0,
        "searchmode": 0,
        "stratum": 15,
        "x0": 124.80264969919024,
        "y0": -103.82515494193763,
        "z0": -0.3145,
        "x1": 124.80015785384354,
        "y1": -103.83812709190445,
        "z1": -0.3409,
        "shrink": 1.9
      },
      {
        "ph": 6.0,
        "phv": 3.0,
        "px0": -55.5,
        "py0": -58.999999999999979,
        "pz0": 0.0,
        "px1": -75.5,
        "py1": -31.66666666666665,
        "pz1": 9.0,
        "searchmode": 0,
        "stratum": 15,
        "x0": 124.79646240234375,
        "y0": -103.83108545454545,
        "z0": -0.3145,
        "x1": 124.80579443359376,
        "y1": -103.83979863636364,
        "z1": -0.3409,
        "shrink": 1.9
      },
      {
        "ph": 6.0,
        "phv": 1.0,
        "px0": -25.0,
        "py0": -89.0,
        "pz0": 0.0,
        "px1": -43.0,
        "py1": -65.0,
        "pz1": 9.0,
        "searchmode": 0,
        "stratum": 15,
        "x0": 124.788064453125,
        "y0": -103.83952749999999,
        "z0": -0.3145,
        "x1": 124.79686328125001,
        "y1": -103.84912931818182,
        "z1": -0.3409,
        "shrink": 1.9
      },
      {
        "ph": 6.0,
        "phv": 1.0,
        "px0": -27.0,
        "py0": -55.0,
        "pz0": 0.0,
        "px1": -7.0,
        "py1": -23.0,
        "pz1": 9.0,
        "searchmode": 0,
        "stratum": 15,
        "x0": 124.7835322265625,
        "y0": -103.82939704545454,
        "z0": -0.3145,
        "x1": 124.7822001953125,
        "y1": -103.83686613636364,
        "z1": -0.3409,
        "shrink": 1.9
      }
    ],
    [
      {
        "ph": 9.0,
        "phv": 110.0,
        "px0": -6.1952998379254494,
        "py0": -28.600486223662891,
        "pz0": 0.0,
        "px1": -2.12074554294976,
        "py1": -44.707455429497578,
        "pz1": 9.0,
        "searchmode": 0,
        "stratum": 13,
        "x0": 124.80710853534617,
        "y0": -103.84377161540446,
        "z0": -0.34090000000000004,
        "x1": 124.81802225280464,
        "y1": -103.85706558696775,
        "z1": -0.3682,
        "shrink": 1.9
      },
      {
        "ph": 6.0,
        "phv": 2.0,
        "px0": -80.0,
        "py0": 55.5,
        "pz0": 0.0,
        "px1": -64.0,
        "py1": 67.5,
        "pz1": 9.0,
        "searchmode": 0,
        "stratum": 13,
        "x0": 124.82519531249999,
        "y0": -103.81760465909092,
        "z0": -0.34090000000000004,
        "x1": 124.8329296875,
        "y1": -103.82340556818183,
        "z1": -0.3682,
        "shrink": 1.9
      }
    ],
    [
      {
        "ph": 10.0,
        "phv": 256.0,
        "px0": 7.3212149102623449,
        "py0": -16.109756097560961,
        "pz0": 0.0,
        "px1": -0.46065347445923832,
        "py1": -41.615508513575691,
        "pz1": 9.0,
        "searchmode": 1,
        "stratum": 13,
        "x0": 124.80608548180079,
        "y0": -103.8416945153851,
        "z0": -0.341,
        "x1": 124.81716014007132,
        "y1": -103.85549411710873,
        "z1": -0.3635,
        "shrink": 1.9
      },
      {
        "ph": 6.0,
        "phv": 4.0,
        "px0": -76.5,
        "py0": 63.666666666666664,
        "pz0": 0.0,
        "px1": -66.5,
        "py1": 66.333333333333329,
        "pz1": 9.0,
        "searchmode": 1,
        "stratum": 13,
        "x0": 124.82606201171875,
        "y0": -103.8166715909091,
        "z0": -0.341,
        "x1": 124.83239599609375,
        "y1": -103.82296068181819,
        "z1": -0.3635,
        "shrink": 1.9
      },
      {
        "ph": 6.0,
        "phv": 4.0,
        "px0": -67.666666666666657,
        "py0": -58.666666666666657,
        "pz0": 0.0,
        "px1": -39.666666666666657,
        "py1": -27.73333333333332,
        "pz1": 9.0,
        "searchmode": 1,
        "stratum": 13,
        "x0": 124.82130761718749,
        "y0": -103.84551672727272,
        "z0": -0.341,
        "x1": 124.8228427734375,
        "y1": -103.84427018181819,
        "z1": -0.3635,
        "shrink": 1.9
      }
    ],
    [
      {
        "ph": 10.0,
        "phv": 340.0,
        "px0": -6.2202663055743379,
        "py0": 3.1861882193635531,
        "pz0": 0.0,
        "px1": 2.4026179192056212,
        "py1": -3.0029338749718115,
        "pz1": 9.0,
        "searchmode": 0,
        "stratum": 13,
        "x0": 124.81750889551243,
        "y0": -103.85497557302888,
        "z0": -0.3635,
        "x1": 124.82821002110485,
        "y1": -103.87362553671447,
        "z1": -0.3896,
        "shrink": 1.9
      }
    ],
    [
      {
        "ph": 10.0,
        "phv": 326.0,
        "px0": -8.8369696969697209,
        "py0": 1.0843636363636175,
        "pz0": 0.0,
        "px1": 1.4389090909090676,
        "py1": 8.6693333333333147,
        "pz1": 9.0,
        "searchmode": 0,
        "stratum": 13,
        "x0": 124.82898616725852,
        "y0": -103.87269987652893,
        "z0": -0.3896,
        "x1": 124.83724660191761,
        "y1": -103.88867779256198,
        "z1": -0.4156,
        "shrink": 1.9
      }
    ],
    [
      {
        "ph": 10.0,
        "phv": 336.0,
        "px0": 1.39874739039666,
        "py0": -0.664832036439547,
        "pz0": 0.0,
        "px1": -5.5323590814196235,
        "py1": -3.2247105712658897,
        "pz1": 9.0,
        "searchmode": 0,
        "stratum": 12,
        "x0": 124.8385510136678,
        "y0": -103.88951845834987,
        "z0": -0.41570000000000007,
        "x1": 124.84739885748303,
        "y1": -103.90720089869564,
        "z1": -0.44210000000000005,
        "shrink": 1.9
      }
    ],
    [
      {
        "ph": 10.0,
        "phv": 459.0,
        "px0": -0.428112614459482,
        "py0": -0.40241902419023434,
        "pz0": 0.0,
        "px1": -0.91875085417521252,
        "py1": 4.0182451824518317,
        "pz1": 9.0,
        "searchmode": 0,
        "stratum": 12,
        "x0": 124.84717953795261,
        "y0": -103.90651802680867,
        "z0": -0.44220000000000004,
        "x1": 124.85631034287395,
        "y1": -103.92333951791903,
        "z1": -0.46830000000000005,
        "shrink": 1.9
      }
    ],
    [
      {
        "ph": 10.0,
        "phv": 335.0,
        "px0": -5.19962335216571,
        "py0": -0.62643382982366913,
        "pz0": 0.0,
        "px1": -0.24362266735146587,
        "py1": -0.22889916110255973,
        "pz1": 9.0,
        "searchmode": 0,
        "stratum": 12,
        "x0": 124.85672558894693,
        "y0": -103.92411401199982,
        "z0": -0.46830000000000005,
        "x1": 124.86440431142061,
        "y1": -103.94000803287108,
        "z1": -0.49460000000000004,
        "shrink": 1.9
      }
    ],
    [
      {
        "ph": 10.0,
        "phv": 424.0,
        "px0": 0.49200443318557086,
        "py0": -0.74509183027231352,
        "pz0": 0.0,
        "px1": -2.7467542748574942,
        "py1": -4.9759341355288047,
        "pz1": 9.0,
        "searchmode": 0,
        "stratum": 12,
        "x0": 124.86530055991544,
        "y0": -103.94076258675658,
        "z0": -0.49460000000000004,
        "x1": 124.87316401804755,
        "y1": -103.95789049085296,
        "z1": -0.5213,
        "shrink": 1.9
      }
    ],
    [
      {
        "ph": 10.0,
        "phv": 432.0,
        "px0": 2.2035716806663155,
        "py0": -0.85614456130443983,
        "pz0": 0.0,
        "px1": -1.3345097762405809,
        "py1": -4.9287075598221222,
        "pz1": 9.0,
        "searchmode": 0,
        "stratum": 12,
        "x0": 124.8728841533692,
        "y0": -103.95877109449296,
        "z0": -0.52140000000000009,
        "x1": 124.88182741141387,
        "y1": -103.97685680276507,
        "z1": -0.5479,
        "shrink": 1.9
      }
    ],
    [
      {
        "ph": 10.0,
        "phv": 438.0,
        "px0": 1.1335850056295329,
        "py0": 0.24889065501027274,
        "pz0": 0.0,
        "px1": 1.8750910656335065,
        "py1": 1.3512153122723432,
        "pz1": 9.0,
        "searchmode": 0,
        "stratum": 12,
        "x0": 124.88159894112917,
        "y0": -103.97578671314777,
        "z0": -0.5479,
        "x1": 124.89360020933638,
        "y1": -104.00455988298671,
        "z1": -0.58819999999999928,
        "shrink": 1.9
      }
    ]
  ],
  "Comments": [
    "{\"stratum\":\"inEmulsion << 3 | layerID << 2 | underBoundary << 1 | nearBase\"}"
  ],
  "CoordinateSystem": "Stage"
}