92, NA ,9
NA, NA, NA
89,K3,8
115,K6,5
NA,E5,5
NA,NA,NA
110,K5,6.5
90,1OG,5
103,E1,7.5
NA, NA, NA
102,E2,7.5
92,K5,5
NA,NA,NA
94,E3,6.5
NA,K5,8.5
85,EP,8.5
NA,NA,8.5
203,W,8
NA,NA,7.5
NA,NA,NA
102,E1,8.5
108,K1,6.5
95,E1,5
53,SOE,6
102,E1,8
NA, NA, NA
NA, NA, NA
NA, NA, NA
NA, NA, NA
NA, NA, NA
113, E1, 8.5
100, E1, 8
NA, K6, 5.75
NA, NA, NA
120, SOE, 8
NA, E6, 5.5
76,EP, 6
NA, NA, NA
84, 1OG, 8.5
102, E1, 7.5
NA, NA, NA
89,E3,7.5
115,1OG,8.5
90, EP, 7.5
92, 1OG,7.5
NA, NA, NA
NA, K1, 7.5
NA, NA, NA
NA, EP, 8.5
97, E6, 5.5
98, E6, 5
102, E6, 5
NA, NA, NA
NA, NA, NA
NA, NA, NA
89, K4, 8
87, K1, 8.5
115, E4, 9
NA, NA, NA
NA,NA,NA
NA,NA,NA
115,K6,8.5
111,E6,8.5
,K6, 6.5
NA,NA,NA
113,E6,8
107,K6,6.5
NA,NA,NA
,E6,8.5
