<svg width="39" height="30" viewBox="0 0 39 30" fill="none" xmlns="http://www.w3.org/2000/svg">
<path fill-rule="evenodd" clip-rule="evenodd" d="M19.5667 0C21.1698 0 22.8141 0.0412502 24.4079 0.10875L26.2904 0.19875L28.0923 0.305625L29.7798 0.42L31.321 0.54C32.9936 0.668021 34.5675 1.38178 35.7658 2.5557C36.964 3.72962 37.7099 5.28851 37.8723 6.95813L37.9473 7.755L38.0879 9.46125C38.2192 11.2294 38.3167 13.1569 38.3167 15C38.3167 16.8431 38.2192 18.7706 38.0879 20.5388L37.9473 22.245C37.9229 22.5188 37.8985 22.7831 37.8723 23.0419C37.7099 24.7118 36.9637 26.2709 35.765 27.4449C34.5664 28.6188 32.9921 29.3324 31.3191 29.46L29.7817 29.5781L28.0942 29.6944L26.2904 29.8012L24.4079 29.8912C22.7951 29.9613 21.181 29.9976 19.5667 30C17.9523 29.9976 16.3382 29.9613 14.7254 29.8912L12.8429 29.8012L11.041 29.6944L9.35353 29.5781L7.81228 29.46C6.13968 29.332 4.56581 28.6182 3.36754 27.4443C2.16926 26.2704 1.42335 24.7115 1.26103 23.0419L1.18603 22.245L1.0454 20.5388C0.902033 18.6959 0.825733 16.8484 0.81665 15C0.81665 13.1569 0.91415 11.2294 1.0454 9.46125L1.18603 7.755C1.2104 7.48125 1.23478 7.21688 1.26103 6.95813C1.42329 5.28881 2.16893 3.73015 3.36682 2.55627C4.56471 1.38238 6.13814 0.668442 7.8104 0.54L9.34978 0.42L11.0373 0.305625L12.841 0.19875L14.7235 0.10875C16.337 0.0386868 17.9517 0.00242866 19.5667 0ZM15.8167 10.4531V19.5469C15.8167 20.4131 16.7541 20.9531 17.5042 20.5219L25.3792 15.975C25.5505 15.8764 25.6928 15.7343 25.7918 15.5631C25.8908 15.392 25.9429 15.1977 25.9429 15C25.9429 14.8023 25.8908 14.608 25.7918 14.4369C25.6928 14.2657 25.5505 14.1236 25.3792 14.025L17.5042 9.48C17.3331 9.38123 17.139 9.32925 16.9415 9.32928C16.7439 9.32931 16.5499 9.38136 16.3788 9.48018C16.2078 9.57901 16.0658 9.72113 15.9671 9.89225C15.8684 10.0634 15.8165 10.2575 15.8167 10.455V10.4531Z" fill="white"/>
</svg>
