<svg width="27" height="30" viewBox="0 0 27 30" fill="none" xmlns="http://www.w3.org/2000/svg">
<path d="M21.4167 4.7C20.2774 3.39937 19.6495 1.72905 19.65 0H14.5V20.6667C14.4603 21.785 13.9881 22.8444 13.183 23.6216C12.3778 24.3988 11.3024 24.8332 10.1833 24.8333C7.81668 24.8333 5.85002 22.9 5.85002 20.5C5.85002 17.6333 8.61668 15.4833 11.4667 16.3667V11.1C5.71668 10.3333 0.68335 14.8 0.68335 20.5C0.68335 26.05 5.28335 30 10.1667 30C15.4 30 19.65 25.75 19.65 20.5V10.0167C21.7383 11.5164 24.2456 12.3211 26.8167 12.3167V7.16667C26.8167 7.16667 23.6833 7.31667 21.4167 4.7Z" fill="white"/>
</svg>
