<svg width="25" height="22" viewBox="0 0 25 22" fill="none" xmlns="http://www.w3.org/2000/svg">
<path d="M12.3897 20.4963C19.7964 20.5535 23.5 19.9469 23.5 18.677C23.5 16.7727 14.8418 7.16782 12.3897 7.16782C9.93767 7.16782 1.27942 16.971 1.27942 18.6775C1.27942 19.8147 4.98303 20.4207 12.3897 20.4963Z" stroke="#1D4EFF" stroke-width="2" stroke-linejoin="round"/>
<path d="M11.7344 13.1657L9.72346 15.5767" stroke="#1D4EFF" stroke-width="2" stroke-linecap="round"/>
<path d="M12.6675 3.27757C13.0358 3.27757 13.389 3.13125 13.6495 2.87081C13.9099 2.61036 14.0563 2.25712 14.0563 1.88879C14.0563 1.52046 13.9099 1.16721 13.6495 0.906766C13.389 0.646318 13.0358 0.5 12.6675 0.5C12.2991 0.5 11.9459 0.646318 11.6854 0.906766C11.425 1.16721 11.2787 1.52046 11.2787 1.88879C11.2787 2.25712 11.425 2.61036 11.6854 2.87081C11.9459 3.13125 12.2991 3.27757 12.6675 3.27757ZM17.9449 6.05515C18.2395 6.05515 18.5221 5.93809 18.7305 5.72973C18.9388 5.52137 19.0559 5.23878 19.0559 4.94412C19.0559 4.64945 18.9388 4.36686 18.7305 4.1585C18.5221 3.95014 18.2395 3.83309 17.9449 3.83309C17.6502 3.83309 17.3676 3.95014 17.1592 4.1585C16.9509 4.36686 16.8338 4.64945 16.8338 4.94412C16.8338 5.23878 16.9509 5.52137 17.1592 5.72973C17.3676 5.93809 17.6502 6.05515 17.9449 6.05515ZM5.72353 8.83272C6.0182 8.83272 6.30079 8.71566 6.50915 8.50731C6.71751 8.29895 6.83456 8.01635 6.83456 7.72169C6.83456 7.42703 6.71751 7.14443 6.50915 6.93607C6.30079 6.72772 6.0182 6.61066 5.72353 6.61066C5.42887 6.61066 5.14627 6.72772 4.93792 6.93607C4.72956 7.14443 4.6125 7.42703 4.6125 7.72169C4.6125 8.01635 4.72956 8.29895 4.93792 8.50731C5.14627 8.71566 5.42887 8.83272 5.72353 8.83272ZM8.77886 5.49963C8.99986 5.49963 9.21181 5.41184 9.36807 5.25557C9.52434 5.0993 9.61213 4.88736 9.61213 4.66636C9.61213 4.44536 9.52434 4.23342 9.36807 4.07715C9.21181 3.92088 8.99986 3.83309 8.77886 3.83309C8.55786 3.83309 8.34592 3.92088 8.18965 4.07715C8.03338 4.23342 7.94559 4.44536 7.94559 4.66636C7.94559 4.88736 8.03338 5.0993 8.18965 5.25557C8.34592 5.41184 8.55786 5.49963 8.77886 5.49963Z" fill="#1D4EFF"/>
</svg>
