<svg width="69" height="82" viewBox="0 0 69 82" fill="none" xmlns="http://www.w3.org/2000/svg">
<path fill-rule="evenodd" clip-rule="evenodd" d="M31.809 1.39757C33.5441 0.710576 35.4559 0.710576 37.191 1.39757L64.0243 12.0265C65.486 12.6052 66.7456 13.6415 67.6347 14.9967C68.5239 16.3519 69.0002 17.9616 69 19.6104V41.3257C69.0001 48.0935 67.2161 54.7276 63.8477 60.4847C60.4794 66.2418 55.6598 70.8943 49.9292 73.921L37.0722 80.7113C36.2736 81.1333 35.3929 81.3529 34.5 81.3529C33.6071 81.3529 32.7264 81.1333 31.9278 80.7113L19.0708 73.921C13.3401 70.8943 8.52061 66.2418 5.15226 60.4847C1.78392 54.7276 -0.000138121 48.0935 5.94849e-08 41.3257V19.6104C-0.000194344 17.9616 0.476115 16.3519 1.36525 14.9967C2.25439 13.6415 3.51399 12.6052 4.97567 12.0265L31.809 1.39757ZM34.5 8.98153L7.66667 19.6104V41.3257C7.66755 46.589 9.05584 51.7481 11.676 56.225C14.2962 60.7019 18.0447 64.3197 22.5017 66.6731L34.5 73.018V8.98153Z" fill="white"/>
</svg>
