{
  "defaultScriptType": "c",
  "schedule": [
    {
      "duration": "00:01:00",
      "script": "Group_1",
      "concurrency": 1
    }
  ],
  "configuration": {
    "isFlow": "no",
    "testname": "default/default/CSAA_issue"
  },
  "scenario": {
    "NS_GENERATOR": {
      "_G": [
        []
      ]
    },
    "G_RBU_SCREEN_SIZE_SIM": {
      "ALL": [
        [
          0
        ]
      ]
    },
    "NUM_USERS": {
      "_G": [
        []
      ]
    },
    "G_INLINE_MIN_CON_REUSE_DELAY": {
      "ALL": [
        []
      ]
    },
    "RBU_ENABLE_CSV": {
      "_G": [
        [
          0
        ]
      ]
    },
    "G_PAGE_RELOAD": {
      "ALL": []
    },
    "G_FIRST_SESSION_PACING": {
      "ALL": [
        [
          0
        ]
      ]
    },
    "G_PAGE_THINK_TIME": {
      "ALL": [
        [
          "ALL",
          0
        ]
      ]
    },
    "G_RBU_SETTINGS": {
      "ALL": [
        []
      ]
    },
    "TARGET_RATE": {
      "_G": [
        []
      ]
    },
    "SCHEDULE": {
      "_G": [
        [
          "ALL",
          "RampUp",
          "RAMP_UP",
          "ALL",
          "TIME",
          "00:01:00",
          "LINEARLY"
        ],
        [
          "ALL",
          "Stabilize",
          "STABILIZATION",
          "TIME",
          "00:01:00"
        ],
        [
          "ALL",
          "Duration",
          "DURATION",
          "SESSIONS",
          "1",
          "0"
        ],
        [
          "ALL",
          "RampDown",
          "RAMP_DOWN",
          "ALL",
          "TIME",
          "00:01:00",
          "LINEARLY"
        ]
      ]
    },
    "TNAME": {
      "_G": [
        [
          "Test"
        ]
      ]
    },
    "G_TRACING": {
      "ALL": [
        [
          "0",
          "1",
          "1",
          "0",
          "0",
          "1",
          "1",
          "1"
        ]
      ]
    },
    "RBU_MARK_MEASURE_MATRIX": {
      "_G": [
        [
          0
        ]
      ]
    },
    "G_REPORTING": {
      "ALL": [
        [
          2,
          10,
          "10",
          "25",
          0,
          500
        ]
      ]
    },
    "GEN_SERVER_SETTING": {},
    "G_RBU_USER_AGENT": {
      "ALL": [
        [
          0
        ]
      ]
    },
    "G_RBU_ADD_ND_FPI": {
      "ALL": [
        [
          2,
          1
        ]
      ]
    },
    "G_CLICK_AWAY": {
      "ALL": []
    },
    "G_RBU_CPU_THROTTLING": {
      "ALL": [
        [
          "0",
          "0"
        ]
      ]
    },
    "G_SCRIPT_RUNLOGIC": {
      "_G": [
        []
      ]
    },
    "SCHEDULE_BY": {
      "_G": [
        [
          "SCENARIO"
        ]
      ]
    },
    "RBU_ENABLE_DUMMY_PAGE": {
      "_G": [
        [
          1,
          ""
        ]
      ]
    },
    "G_RBU_CACHE_DOMAIN": {
      "ALL": [
        [
          0
        ]
      ]
    },
    "STYPE": {
      "_G": [
        [
          "FIX_CONCURRENT_USERS"
        ]
      ]
    },
    "SGRP": {
      "_G": [
        [
          "Group_1",
          "NA",
          "NA",
          "Internet",
          "0",
          "default/default/rbu",
          "1",
          "",
          ""
        ]
      ]
    },
    "G_RBU_ADD_HEADER": {
      "ALL": [
        [
          1
        ]
      ]
    },
    "G_CONTINUE_ON_PAGE_ERROR": {
      "ALL": [
        [
          "ALL",
          0
        ]
      ]
    },
    "G_RBU": {
      "ALL": [
        [
          "ALL",
          1,
          1,
          1,
          1,
          1,
          0
        ]
      ],
      "Group_1": [
        [
          "ALL",
          1,
          1,
          1,
          1,
          1,
          0
        ]
      ]
    },
    "PROF_PCT_MODE": {
      "_G": [
        [
          "NUM"
        ]
      ]
    },
    "RBU_BROWSER_COM_SETTINGS": {
      "_G": [
        [
          1,
          "5",
          1000
        ]
      ]
    },
    "GEN_LOCATION": {
      "_G": [
        []
      ]
    },
    "G_URL": {},
    "G_RBU_CAPTURE_CLIPS": {
      "ALL": [
        []
      ]
    },
    "G_RBU_ENABLE_TTI_MATRIX": {
      "ALL": [
        [
          0
        ]
      ]
    },
    "G_NEW_USER_ON_SESSION": {
      "ALL": [
        [
          1,
          0,
          0
        ]
      ]
    },
    "RBU_POST_PROC": {
      "_G": [
        [
          0
        ]
      ]
    },
    "G_OVERRIDE_RECORDED_THINK_TIME": {
      "ALL": [
        [
          "ALL",
          0
        ]
      ]
    },
    "G_RBU_BLOCK_URL_LIST": {
      "ALL": [
        [
          "NA"
        ]
      ]
    },
    "RBU_ORIGIN_DOMAIN": {
      "_G": [
        [
          ""
        ]
      ]
    },
    "G_DATADIR": {
      "ALL": [
        [
          "0",
          "NA"
        ]
      ],
      "Group_1": [
        [
          "0",
          "NA"
        ]
      ]
    },
    "G_RBU_CAPTURE_PERFORMANCE_TRACE": {
      "ALL": [
        []
      ]
    },
    "NH_SCENARIO": {
      "_G": [
        [],
        [],
        [],
        [],
        [],
        []
      ]
    },
    "G_RBU_PAGE_LOADED_TIMEOUT": {
      "ALL": [
        [
          1500
        ]
      ]
    },
    "G_RBU_BROWSER_SETTING": {
      "ALL": [
        [
          1,
          "/home/cavisson/thirdparty/chrome/chrome_117",
          "NA"
        ]
      ]
    },
    "G_RBU_LIGHTHOUSE_SETTING": {
      "ALL": [
        [
          0,
          "NA"
        ]
      ]
    },
    "G_RBU_RM_PROF_SUB_DIR": {
      "ALL": [
        [
          0,
          "-"
        ]
      ]
    },
    "G_RBU_THROTTLING_SETTING": {
      "ALL": [
        [
          0,
          0,
          0,
          0
        ]
      ]
    },
    "G_SESSION_PACING": {
      "ALL": [
        [
          "0"
        ]
      ]
    },
    "NS_GENERATOR_MODE": {
      "_G": [
        [
          ""
        ]
      ]
    },
    "G_INLINE_DELAY": {
      "ALL": [
        [
          "ALL",
          "0"
        ]
      ]
    },
    "RUNTIME_USER_SESSION_PCT": {
      "_G": [
        []
      ]
    },
    "SCHEDULE_TYPE": {
      "_G": [
        [
          "SIMPLE"
        ]
      ]
    },
    "GEN_LOCATION_MODE": {
      "_G": [
        [
          "0"
        ]
      ]
    },
    "RBU_DOMAIN_STAT": {
      "_G": [
        [
          0
        ]
      ]
    },
    "G_RBU_CACHE_SETTING": {
      "ALL": [
        [
          1,
          1,
          1
        ]
      ]
    },
    "G_RBU_CLEAN_UP_PROF_ON_SESSION_START": {
      "ALL": [
        [
          0
        ]
      ]
    },
    "G_SHOW_RUNTIME_RUNLOGIC_PROGRESS": {
      "ALL": [
        [
          0
        ]
      ]
    },
    "G_RBU_HAR_TIMEOUT": {
      "ALL": [
        [
          "60"
        ]
      ]
    },
    "G_RBU_HAR_SETTING": {
      "ALL": [
        [
          1,
          0,
          0,
          1,
          0,
          "1000",
          1500
        ]
      ]
    },
    "G_RBU_ALERT_SETTING": {
      "ALL": [
        [
          0
        ]
      ]
    },
    "G_VUSER_TRACE": {
      "ALL": [
        [
          0
        ]
      ]
    },
    "G_RBU_DOMAIN_IGNORE_LIST": {
      "ALL": [
        [
          "NA"
        ]
      ]
    },
    "RBU_ALERT_POLICY": {
      "_G": [
        [
          1,
          "0:undefined"
        ]
      ]
    },
    "G_TRACING_LIMIT": {
      "ALL": [
        [
          1024,
          10240,
          10240,
          1048576
        ]
      ]
    },
    "G_LOGGING": {
      "ALL": [
        [
          "1",
          0
        ]
      ]
    },
    "G_RBU_PAGE_SPEED": {
      "ALL": [
        [
          1
        ]
      ]
    }
  },
  "lastModifedBy": "Abhishek",
  "scripts": {
    "Group_1": {
      "headers": {
        "Accept": "text/plain,application/json,text/html,application/javascript,application/xml",
        "User-Agent": "Mozilla/5.0 (Windows; U; Windows NT 6.0; de-DE) AppleWebKit/533.21.1 (KHTML, like Gecko) Version/5.0.5 Safari/533.21.1",
        "Accept-Encoding": " gzip, deflate, br, compress;q\u003d0.9"
      },
      "flows": {},
      "scriptType": "c",
      "genCapacity": 0,
      "order": 0
    }
  },
  "version": "1.0",
  "lastModifedTime": "15/06/2024 00:01:04",
  "info": "This is auto generated scenario configuration JSON created by UI. You should not manually edit this file as any syntax error may result in loss of complete configuration. If you make any changes, you must run following program to validate and convert to scenario file used for the running test: nsu_json_to_cav_script  -p \u003cproject\u003e/\u003csub-project\u003e/\u003cscenario_name\u003e -u \u003cusername\u003e -s \u003cwork space\u003e (e.g admin/system or \u003cusername\u003e/\u003cprofile\u003e)"
}