--Request 
GET http://10.10.30.73:9002/tours/index.html
Host: 10.10.30.73:9002
Upgrade-Insecure-Requests: 1
User-Agent: Mozilla/5.0 (X11; Linux x86_64) AppleWebKit/537.36 (KHTML, like Gecko) Chrome/114.0.0.0 Safari/537.36
Accept: text/html,application/xhtml+xml,application/xml;q=0.9,image/avif,image/webp,image/apng,*/*;q=0.8,application/signed-exchange;v=b3;q=0.7
Accept-Encoding: gzip, deflate
Accept-Language: en-US,en;q=0.9
----
--Response 
HTTP/1.1 200 OK
Content-Length: 2975
Content-Type: text/html
Connection: Keep-Alive
----
--Request 
GET http://10.10.30.73:9002/tours/Merc10-dev/images/banner_animated.gif
Host: 10.10.30.73:9002
User-Agent: Mozilla/5.0 (X11; Linux x86_64) AppleWebKit/537.36 (KHTML, like Gecko) Chrome/114.0.0.0 Safari/537.36
Accept: image/avif,image/webp,image/apng,image/svg+xml,image/*,*/*;q=0.8
Referer: http://10.10.30.73:9002/tours/index.html
Accept-Encoding: gzip, deflate
Accept-Language: en-US,en;q=0.9
----
--Response 
HTTP/1.1 200 OK
Content-Length: 16522
Content-Type: image/gif
Connection: Keep-Alive
----
--Request 
GET http://10.10.30.73:9002/tours/Merc10-dev/images/sun_swede.gif
Host: 10.10.30.73:9002
User-Agent: Mozilla/5.0 (X11; Linux x86_64) AppleWebKit/537.36 (KHTML, like Gecko) Chrome/114.0.0.0 Safari/537.36
Accept: image/avif,image/webp,image/apng,image/svg+xml,image/*,*/*;q=0.8
Referer: http://10.10.30.73:9002/tours/index.html
Accept-Encoding: gzip, deflate
Accept-Language: en-US,en;q=0.9
----
--Response 
HTTP/1.1 200 OK
Content-Length: 4125
Content-Type: image/gif
Connection: Keep-Alive
----
--Request 
GET http://10.10.30.73:9002/tours/Merc10-dev/images/login.gif
Host: 10.10.30.73:9002
User-Agent: Mozilla/5.0 (X11; Linux x86_64) AppleWebKit/537.36 (KHTML, like Gecko) Chrome/114.0.0.0 Safari/537.36
Accept: image/avif,image/webp,image/apng,image/svg+xml,image/*,*/*;q=0.8
Referer: http://10.10.30.73:9002/tours/index.html
Accept-Encoding: gzip, deflate
Accept-Language: en-US,en;q=0.9
----
--Response 
HTTP/1.1 200 OK
Content-Length: 1323
Content-Type: image/gif
Connection: Keep-Alive
----
--Request 
GET http://10.10.30.73:9002/tours/images/banner_merctur.jpg
Host: 10.10.30.73:9002
User-Agent: Mozilla/5.0 (X11; Linux x86_64) AppleWebKit/537.36 (KHTML, like Gecko) Chrome/114.0.0.0 Safari/537.36
Accept: image/avif,image/webp,image/apng,image/svg+xml,image/*,*/*;q=0.8
Referer: http://10.10.30.73:9002/tours/index.html
Accept-Encoding: gzip, deflate
Accept-Language: en-US,en;q=0.9
----
--Response 
HTTP/1.1 200 OK
Content-Length: 22548
Content-Type: image/jpeg
Connection: Keep-Alive
----
--Request 
GET http://10.10.30.73:9002/favicon.ico
Host: 10.10.30.73:9002
User-Agent: Mozilla/5.0 (X11; Linux x86_64) AppleWebKit/537.36 (KHTML, like Gecko) Chrome/114.0.0.0 Safari/537.36
Accept: image/avif,image/webp,image/apng,image/svg+xml,image/*,*/*;q=0.8
Referer: http://10.10.30.73:9002/tours/index.html
Accept-Encoding: gzip, deflate
Accept-Language: en-US,en;q=0.9
----
--Response 
HTTP/1.1 200 OK
Content-Length: 1406
Connection: Keep-Alive
----

