--Request 
GET https://api.croma.com/lookup/mobile-app/v1/storelocation?latitude=19.1047153&longitude=72.826827&
Host: api.croma.com
sec-ch-ua: \"Not.A/Brand\";v=\"8\", \"Chromium\";v=\"114\"
Accept: application/json, text/plain, */*
sec-ch-ua-mobile: ?0
User-Agent: Mozilla/5.0 (X11; Linux x86_64) AppleWebKit/537.36 (KHTML, like Gecko) Chrome/114.0.0.0 Safari/537.36
sec-ch-ua-platform: \"Linux\"
Sec-Fetch-Site: same-site
Sec-Fetch-Mode: cors
Sec-Fetch-Dest: empty
Referer: https://www.croma.com/
Accept-Encoding: gzip, deflate, br
Accept-Language: en-US,en;q=0.9
Cookie: AKA_A2=A; at_check=true; AMCVS_E78F53F05EFEF21E0A495E58%40AdobeOrg=1; s_ecid=MCMID%7C23208888194201725061814923007976880958; mbox=session#895fcaa2d50341f0b4231873c20498c7#1715841000|PC#895fcaa2d50341f0b4231873c20498c7.41_0#1779083940; s_plt=NaN; s_pltp=undefined; s_cc=true; _gcl_au=1.1.1421799651.1715839140; AMCV_E78F53F05EFEF21E0A495E58%40AdobeOrg=179643557%7CMCIDTS%7C19860%7CMCMID%7C23208888194201725061814923007976880958%7CMCAAMLH-1716443939%7C12%7CMCAAMB-1716443939%7C6G1ynYcLPuiQxYZrsz_pkqfLG9yMXBpb2zX5dvJdYQJzPXImdj0y%7CMCOPTOUT-1715846339s%7CNONE%7CMCAID%7CNONE%7CMCSYNCSOP%7C411-19867%7CvVersion%7C5.5.0; _hjSessionUser_3400595=eyJpZCI6Ijk2YjE5NmY3LWRkMzMtNTkxYy1iY2IyLTIzMDNlMDRkNzEyNSIsImNyZWF0ZWQiOjE3MTU4MzkxNDA2MDUsImV4aXN0aW5nIjpmYWxzZX0=; _hjSession_3400595=eyJpZCI6ImFiMTJiMDJjLTFjMWYtNDJkOC1iOGYxLTAwY2Q2ZDYyMWM1ZSIsImMiOjE3MTU4MzkxNDA2MDksInMiOjAsInIiOjAsInNiIjowLCJzciI6MCwic2UiOjAsImZzIjoxLCJzcCI6MH0=; _fbp=fb.1.1715839140634.281453602; _ga=GA1.1.1944455297.1715839141; _uetsid=6467a920134911efa7d615e2de33fb03; _uetvid=6467fc40134911efa1829f1407dcc88b; WZRK_G=6f08a8df4ce04ff4b786855393b6d325; SameSite=None; WZRK_S_679-6RK-976Z=%7B%22p%22%3A1%2C%22s%22%3A1715839141%2C%22t%22%3A1715839141%7D; cto_bundle=EPlPXl9ZQjN2TTdzaTNPd0Q0dlByN3VaMFZKWVpFMmRIUXg4WFZHd0t1eUFlY3ZJZHhZOGdWZU1pa0FqeGs0VVBSczlOOXJabXAxU3g5bkRtVEh3Vm9aTE1CMWJnUDJkJTJCNFN1WWxUWmoxN0wybzBtaXVnSyUyQnVpNHh5VTBXQ1BUZHFrQmY; s_ips=612; s_nr30=1715839164397-New; s_sq=%5B%5BB%5D%5D; s_tp=908; s_ppv=plp%2C219%2C67%2C1993%2C1%2C1; ADRUM_BTa=R:22|g:af906dd9-630a-4d9b-bcf3-daabc7daddcd|n:croma_8daa6763-f095-4960-bcf6-a055aea3f7aa; ADRUM_BT1=R:22|i:81146|e:30|d:69; _ga_DJ3RGVFHJN=GS1.1.1715839140.1.1.1715839165.35.0.0
----
--Response 
HTTP/1.1 200
pragma: no-cache
content-type: application/json
etag: \"0aea75f9798fd14c7f2b58ed49052b4bd\"
x-xss-protection: 1; mode=block
request-context: appId=cid-v1:8a027b7f-7450-437d-9b4c-a47116067af5
content-encoding: gzip
content-length: 2523
cache-control: public, max-age=1800
expires: Thu, 16 May 2024 06:29:25 GMT
date: Thu, 16 May 2024 05:59:25 GMT
vary: Accept-Encoding
server-timing: cdn-cache; desc=HIT
server-timing: edge; dur=1
server-timing: ak_p; desc=\"1715839165788_388943756_2294475771_33_15796_5_0_219\";dur=1
x-content-type-options: nosniff
x-frame-options: SAMEORIGIN
strict-transport-security: max-age=16070400; includeSubDomains
----
--Request 
GET https://13135721.fls.doubleclick.net/activityi;dc_pre=CLqT2_--kYYDFUqNrAIds_sORw;src=13135721;type=croma03;cat=croma0;ord=2792844007821;u=%2Fcampaign%2Foneplus-r-5g%2Fc%2F6407;npa=0;auiddc=1421799651.1715839140;uaa=x86;uab=64;uafvl=Not.A%252FBrand%3B8.0.0.0%7CChromium%3B114.0.5735.199;uamb=0;uam=;uap=Linux;uapv=5.15.0;uaw=0;pscdl=noapi;frm=0;gtm=45fe45f0z8889407033za201;gcd=13l3l3l3l1;dma=0;epver=2;~oref=https%3A%2F%2Fwww.croma.com%2Fcampaign%2Foneplus-r-5g%2Fc%2F6407%3Fq%3D%253Aprice-asc?
Host: 13135721.fls.doubleclick.net
Upgrade-Insecure-Requests: 1
User-Agent: Mozilla/5.0 (X11; Linux x86_64) AppleWebKit/537.36 (KHTML, like Gecko) Chrome/114.0.0.0 Safari/537.36
Accept: text/html,application/xhtml+xml,application/xml;q=0.9,image/avif,image/webp,image/apng,*/*;q=0.8,application/signed-exchange;v=b3;q=0.7
Sec-Fetch-Site: cross-site
Sec-Fetch-Mode: navigate
Sec-Fetch-User: ?1
Sec-Fetch-Dest: iframe
sec-ch-ua: \"Not.A/Brand\";v=\"8\", \"Chromium\";v=\"114\"
sec-ch-ua-mobile: ?0
sec-ch-ua-platform: \"Linux\"
Referer: https://www.croma.com/
Accept-Encoding: gzip, deflate, br
Accept-Language: en-US,en;q=0.9
----
--Response 
HTTP/1.1 200
p3p: policyref=\"https://googleads.g.doubleclick.net/pagead/gcn_p3p_.xml\", CP=\"CURa ADMa DEVa TAIo PSAo PSDo OUR IND UNI PUR INT DEM STA PRE COM NAV OTC NOI DSP COR\"
timing-allow-origin: *
cross-origin-resource-policy: cross-origin
date: Thu, 16 May 2024 05:59:25 GMT
expires: Thu, 16 May 2024 05:59:25 GMT
cache-control: private, max-age=0
strict-transport-security: max-age=21600
content-type: text/html; charset=UTF-8
x-content-type-options: nosniff
content-encoding: br
server: cafe
content-length: 391
x-xss-protection: 0
set-cookie: test_cookie=CheckForPermission; expires=Thu, 16-May-2024 06:14:25 GMT; path=/; domain=.doubleclick.net; Secure; HttpOnly; SameSite=none
alt-svc: h3=\":443\"; ma=2592000,h3-29=\":443\"; ma=2592000
----

