--Request 
POST https://bom-col.eum-appdynamics.com/eumcollector/beacons/browser/v1/BO-AAB-FBK/adrum
Host: bom-col.eum-appdynamics.com
sec-ch-ua: \"Not.A/Brand\";v=\"8\", \"Chromium\";v=\"114\"
sec-ch-ua-platform: \"Linux\"
sec-ch-ua-mobile: ?0
User-Agent: Mozilla/5.0 (X11; Linux x86_64) AppleWebKit/537.36 (KHTML, like Gecko) Chrome/114.0.0.0 Safari/537.36
Content-type: text/plain
Accept: */*
Sec-Fetch-Site: cross-site
Sec-Fetch-Mode: cors
Sec-Fetch-Dest: empty
Referer: https://www.croma.com/
Accept-Encoding: gzip, deflate, br
Accept-Language: en-US,en;q=0.9
----
 POSTDATA {"vr":"23.10.1.4359","dt":"R","rg":"0","es":[{"eg":"1","et":2,"eu":"0://1/2/3/4/5?6","ts":1715839160967,"mg":"0","au":"0://7/8/9/10/5","at":0,"pp":3,"mx":{"PLC":1,"FBT":534,"DDT":0,"DPT":1,"PLT":535,"ARE":0},"md":"GET","xs":200,"si":17},{"eg":"2","et":2,"eu":"0://1/11/3/12/13?14","ts":1715839161499,"mg":"0","au":"0://7/8/9/10/5","at":0,"pp":3,"mx":{"PLC":1,"FBT":18,"DDT":1,"DPT":0,"PLT":19,"ARE":0},"md":"GET","xs":200,"si":18},{"eg":"3","et":2,"eu":"0://1/11/3/12/13?14","ts":1715839161500,"mg":"0","au":"0://7/8/9/10/5","at":0,"pp":3,"mx":{"PLC":1,"FBT":21,"DDT":2,"DPT":0,"PLT":23,"ARE":0},"md":"GET","xs":200,"si":19},{"eg":"4","et":2,"eu":"0://1/11/3/12/13?14","ts":1715839164413,"mg":"0","au":"0://7/15/16/10/17?18","at":0,"pp":3,"mx":{"PLC":1,"FBT":16,"DDT":1,"DPT":0,"PLT":17,"ARE":0},"md":"GET","xs":200,"si":20},{"eg":"5","et":2,"eu":"0://19/20/21/22/23","ts":1715839164407,"mg":"0","au":"0://7/15/16/10/17?18","at":0,"pp":3,"mx":{"PLC":1,"FBT":108,"DDT":1,"DPT":0,"PLT":109,"ARE":0},"md":"POST","xs":200,"si":21},{"eg":"6","et":2,"eu":"0://1/24/25/3/26?27","ts":1715839164431,"mg":"0","au":"0://7/15/16/10/17?18","at":0,"pp":3,"mx":{"PLC":1,"FBT":114,"DDT":1,"DPT":1,"PLT":116,"ARE":0},"md":"GET","xs":200,"si":22},{"eg":"7","et":2,"eu":"0://1/28/29/3/30?31","ts":1715839164413,"mg":"0","au":"0://7/15/16/10/17?18","at":0,"pp":3,"mx":{"PLC":1,"FBT":145,"DDT":1,"DPT":0,"PLT":146,"ARE":0},"md":"GET","xs":200,"si":23},{"eg":"8","et":2,"eu":"0://1/28/29/3/30?32","ts":1715839164414,"mg":"0","au":"0://7/15/16/10/17?18","at":0,"pp":3,"mx":{"PLC":1,"FBT":1130,"DDT":0,"DPT":0,"PLT":1130,"ARE":0},"md":"GET","xs":200,"si":24},{"eg":"9","et":2,"eu":"0://1/2/3/4/17?33","ts":1715839164414,"mg":"0","au":"0://7/15/16/10/17?18","at":0,"pp":3,"mx":{"PLC":1,"FBT":1144,"DDT":0,"DPT":0,"PLT":1144,"ARE":0},"md":"GET","xs":200,"si":25},{"eg":"10","et":2,"eu":"0://19/34/23/3","ts":1715839164381,"mg":"0","au":"0://7/15/16/10/17?18","at":0,"pp":3,"mx":{"PLC":1,"FBT":1304,"DDT":3,"DPT":0,"PLT":1307,"ARE":0},"md":"POST","xs":200,"si":26},{"eg":"11","et":2,"eu":"0://1/11/3/12/13?14","ts":1715839165666,"mg":"0","au":"0://7/15/16/10/17?18","at":0,"pp":3,"mx":{"PLC":1,"FBT":90,"DDT":1,"DPT":0,"PLT":91,"ARE":0},"md":"GET","xs":200,"si":27},{"eg":"12","et":2,"eu":"0://1/35/36/37/38/39/","ts":1715839165627,"mg":"0","au":"0://7/15/16/10/17?18","at":0,"pp":3,"mx":{"PLC":1,"FBT":143,"DDT":1,"DPT":0,"PLT":144,"ARE":0},"md":"POST","xs":200,"si":28},{"eg":"13","et":2,"eu":"0://1/24/25/3/26?27","ts":1715839165758,"mg":"0","au":"0://7/15/16/10/17?18","at":0,"pp":3,"mx":{"PLC":1,"FBT":56,"DDT":1,"DPT":0,"PLT":57,"ARE":0},"md":"GET","xs":200,"si":29},{"eg":"14","et":2,"eu":"0://19/34/23/3","ts":1715839165602,"mg":"0","au":"0://7/15/16/10/17?18","at":0,"pp":3,"mx":{"PLC":1,"FBT":214,"DDT":10,"DPT":0,"PLT":224,"ARE":0},"md":"POST","xs":200,"si":30},{"eg":"15","et":2,"eu":"0://19/34/23/3","ts":1715839165809,"mg":"0","au":"0://7/15/16/10/17?18","at":0,"pp":3,"mx":{"PLC":1,"FBT":137,"DDT":1,"DPT":0,"PLT":138,"ARE":0},"md":"POST","xs":200,"si":31},{"eg":"16","et":2,"eu":"0://40/41/42/43/44/45/46","ts":1715839166216,"mg":"0","au":"0://7/15/16/10/17?18","at":0,"pp":3,"mx":{"PLC":1,"FBT":49,"DDT":0,"DPT":1,"PLT":50,"ARE":0},"md":"POST","xs":200,"si":32}],"ai":"477d42aa_9f21_9144_1a76_688c9aa25e4b","gs":["94fc8c22_8b4e_9951_5dd4_a346d07ee981","6a42d6b9_2797_297b_1612_0800c03eb8a2","d26202eb_6bb6_f2bb_f668_db591890f7fd","caaffb9a_f223_4580_ea2d_899de78c9a36","0f037088_919d_b852_48c3_a4af46a4f0c2","1639e880_a170_cf84_eb25_3a3c0b770517","ca94ae3a_1d25_36be_864d_60f45aee6963","c57dabf2_f89c_815f_df26_4d44dd3549cd","8abc7548_655e_baa5_004f_77630a5fcbf0","025754c7_ecb1_7261_6832_7160fea005a4","7bd3f82c_0a94_6ccf_4e9e_e19825d0d1a5","f8b60bbb_6f66_89cc_9494_109284cf5ac7","1778f939_8836_89de_1abc_86ac91ce41ae","db21d4f6_5e43_7542_571d_9a152fbab03d","42045af3_697d_2e36_7509_9bff3b3d5fd4","c2ea6d31_3a1c_4403_9cbc_01ba852bd7a0","39b7de8c_f929_f868_d927_fdb70abb7f9f"],"up":["https","api.croma.com","searchservices","v1","category","10","currentPage=0&query=:relevance&fields=FULL&channel=WEB&channelCode=400049","www.croma.com","phones-wearables","mobile-phones","c","pwagoogle","getgeocode","400049","components='country:IN|postal_code:400049'","campaign","oneplus-r-5g","6407","q=%3Aprice-asc","api.tatadigital.com","api","v1.1","msd","events","lookup","mobile-app","storelocation","latitude=19.1047153&longitude=72.826827&","cmstemplate","allchannels","page","pageType=ContentPage&pageLabelOrId=/c/6407&fields=FULL","pageType=CategoryPage&code=6407&fields=DEFAULT","currentPage=0&query=%3Aprice-asc&fields=FULL&channel=WEB&channelCode=400049","analytics-engine","inventory","oms","v2","tms","details-pwa","smetrics.croma.com","b","ss","infinitipwa","1","JS-2.25.0-LDQM","s31935144306421"]}
--Response 
HTTP/1.1 200
date: Thu, 16 May 2024 05:59:26 GMT
content-type: text/html
set-cookie: ADRUM_BTa=R:22|g:f25bdd2b-79cb-4ddd-9054-3551c79f0af6; Path=/; Expires=Thu, 16-May-2024 05:59:56 GMT; Max-Age=30
set-cookie: ADRUM_BTa=R:22|g:f25bdd2b-79cb-4ddd-9054-3551c79f0af6|n:appdynamics_46b45e6c-9ffd-4db5-9fe0-e4760639f012; Path=/; Expires=Thu, 16-May-2024 05:59:56 GMT; Max-Age=30
set-cookie: SameSite=None; Path=/; Expires=Thu, 16-May-2024 05:59:56 GMT; Max-Age=30; Secure
set-cookie: ADRUM_BT1=R:22|i:57892; Path=/; Expires=Thu, 16-May-2024 05:59:56 GMT; Max-Age=30
set-cookie: ADRUM_BT1=R:22|i:57892|e:12; Path=/; Expires=Thu, 16-May-2024 05:59:56 GMT; Max-Age=30
set-cookie: ADRUM_BT1=R:22|i:57892|e:12|t:1715839166519; Path=/; Expires=Thu, 16-May-2024 05:59:56 GMT; Max-Age=30
expires: 0
cache-control: private, no-cache, no-store, must-revalidate, max-age=0, proxy-revalidate, s-maxage=0
pragma: no-cache
vary: *
x-content-type-options: nosniff
strict-transport-security: max-age=31536010; includeSubDomains
access-control-allow-origin: *
access-control-allow-headers: origin, content-type, accept
x-envoy-upstream-service-time: 0
server: envoy
----

