--Request 
POST https://10.10.30.9:8003/test_rum?s=001403978702638809130&p=1&m=0&op=useraction&pi=1&CavStore=-1&pid=-1&d=0|0&lts=326889366&nvcounter=3
Host: 10.10.30.9:8003
sec-ch-ua: \"Not.A/Brand\";v=\"8\", \"Chromium\";v=\"114\"
sec-ch-ua-platform: \"Linux\"
sec-ch-ua-mobile: ?0
User-Agent: Mozilla/5.0 (X11; Linux x86_64) AppleWebKit/537.36 (KHTML, like Gecko) Chrome/114.0.0.0 Safari/537.36
Content-Type: text/plain;charset=UTF-8
Accept: */*
Sec-Fetch-Site: same-origin
Sec-Fetch-Mode: no-cors
Sec-Fetch-Dest: empty
Referer: https://10.10.30.9:8003/tours/index.html
Accept-Encoding: gzip, deflate, br
Accept-Language: en-US,en;q=0.9
Cookie: CavVI=001403978702638809130; CavSF=2,,1:0:0,1715423665055,0|,,,,1,,,1,,,,; CavNVC=001403978702638809130-1-326889265-1
----
 POSTDATA 001403978702638809130|-1|1|326889366128|229|2|:nth-child(5) > td > input|-3|login|INPUT|image|47|676|95|25|||-1|-1||{"id":":nth-child(5) > td > input"}|/html/body/table/tbody/tr[2]/td/table/tbody/tr/td/form/center/table/tbody/tr[5]/td/input
001403978702638809130|-1|1|326889366145|0|1001||-2||||0|0|1521|527|||1000|1000||{}|

--Response 
HTTP/1.1 200 OK
Content-Length: 0000000001
Content-Type: text/plain
Access-Control-Allow-Origin: *
Timing-Allow-Origin: *
Access-Control-Allow-Credentials: true
Access-Control-Allow-Methods: POST, PUT, DELETE, GET, OPTIONS
Access-Control-Request-Headers: *
Access-Control-Allow-Headers: Origin, X-Requested-With, Content-Type, Accept, Authorization, Content-Encoding
Access-Control-Max-Age: 300
cache-control: no-store
Connection: Keep-Alive
----

