--Request 
GET https://www.facebook.com/tr/?id=1369867960112522&ev=PageView&dl=https%3A%2F%2Fwww.croma.com%2Fphones-wearables%2Fmobile-phones%2Fc%2F10&rl=&if=false&ts=1715839155877&sw=1523&sh=650&v=2.9.156&r=stable&ec=2&o=4126&fbp=fb.1.1715839140634.281453602&ler=empty&cdl=API_unavailable&it=1715839140500&coo=false&rqm=GET
Host: www.facebook.com
sec-ch-ua: \"Not.A/Brand\";v=\"8\", \"Chromium\";v=\"114\"
sec-ch-ua-mobile: ?0
User-Agent: Mozilla/5.0 (X11; Linux x86_64) AppleWebKit/537.36 (KHTML, like Gecko) Chrome/114.0.0.0 Safari/537.36
sec-ch-ua-platform: \"Linux\"
Accept: image/avif,image/webp,image/apng,image/svg+xml,image/*,*/*;q=0.8
Sec-Fetch-Site: cross-site
Sec-Fetch-Mode: no-cors
Sec-Fetch-Dest: image
Referer: https://www.croma.com/
Accept-Encoding: gzip, deflate, br
Accept-Language: en-US,en;q=0.9
----
--Response 
HTTP/1.1 200
content-type: text/plain
access-control-allow-credentials: true
strict-transport-security: max-age=31536000; includeSubDomains
cross-origin-resource-policy: cross-origin
content-length: 0
server: proxygen-bolt
x-fb-connection-quality: EXCELLENT; q=0.9, rtt=8, rtx=0, c=23, mss=1232, tbw=4260, tp=9, tpl=0, uplat=0, ullat=0
alt-svc: h3=\":443\"; ma=86400
priority: u=3,i
date: Thu, 16 May 2024 05:59:15 GMT
----
--Request 
GET https://smetrics.croma.com/b/ss/infinitipwa/1/JS-2.25.0-LDQM/s31676959719108?AQB=1&ndh=1&pf=1&t=16%2F4%2F2024%200%3A59%3A15%204%20300&mid=23208888194201725061814923007976880958&aamlh=12&ce=UTF-8&pageName=homepage&g=https%3A%2F%2Fwww.croma.com%2F&cc=INR&server=www.croma.com&events=event4&c1=homepage&v1=D%3Dmid&c2=www.croma.com%2F&v2=new&c3=2024-5-16%200%3A59%3A15&l3=cat%20nav%3Amobiles%3Ahomepage&v4=guest%20user&v15=banner%3Amobiles&v16=banner_clicked&v17=homepage%3Acat%20nav&v39=RL9bd43344037f476081fbf32b9dc7acb2&v53=https%3A%2F%2Fwww.croma.com%2Fphones-wearables%2Fmobile-phones%2Fc%2F10&v71=banner%3Amobiles%7Chomepage%3Acat%20nav%7Cbanner_clicked&v121=no&v131=Direct%20Call%20%2850%29%20%3A%20%5BotherClick%5D%20%3A%20Other%20Click&v156=cat%20nav%3Amobiles%3Ahomepage&pe=lnk_o&pev2=banner%3Amobiles&c.&a.&activitymap.&page=homepage&link=undefined&region=comp_0000BOKQ&pageIDType=1&.activitymap&.a&.c&pid=homepage&pidt=1&oid=function%28c%29%7Bvarq%3Db.Qa%28f%2Cc%2Ce%2Cl%29%3Ba.conf.ja%26%26%28q.oa%3Dx%29%3Breturnb.sh%28n%2Cq%2Cthis%2Carguments%29%7D&oidt=2&ot=IMG&s=1523x650&c=24&j=1.6&v=N&k=Y&bw=790&bh=473&mcorgid=E78F53F05EFEF21E0A495E58%40AdobeOrg&lrt=50&AQE=1
Host: smetrics.croma.com
sec-ch-ua: \"Not.A/Brand\";v=\"8\", \"Chromium\";v=\"114\"
sec-ch-ua-mobile: ?0
User-Agent: Mozilla/5.0 (X11; Linux x86_64) AppleWebKit/537.36 (KHTML, like Gecko) Chrome/114.0.0.0 Safari/537.36
sec-ch-ua-platform: \"Linux\"
Accept: image/avif,image/webp,image/apng,image/svg+xml,image/*,*/*;q=0.8
Sec-Fetch-Site: same-site
Sec-Fetch-Mode: no-cors
Sec-Fetch-Dest: image
Referer: https://www.croma.com/
Accept-Encoding: gzip, deflate, br
Accept-Language: en-US,en;q=0.9
Cookie: AKA_A2=A; at_check=true; AMCVS_E78F53F05EFEF21E0A495E58%40AdobeOrg=1; s_ecid=MCMID%7C23208888194201725061814923007976880958; mbox=session#895fcaa2d50341f0b4231873c20498c7#1715841000|PC#895fcaa2d50341f0b4231873c20498c7.41_0#1779083940; s_plt=NaN; s_pltp=undefined; s_cc=true; _gcl_au=1.1.1421799651.1715839140; AMCV_E78F53F05EFEF21E0A495E58%40AdobeOrg=179643557%7CMCIDTS%7C19860%7CMCMID%7C23208888194201725061814923007976880958%7CMCAAMLH-1716443939%7C12%7CMCAAMB-1716443939%7C6G1ynYcLPuiQxYZrsz_pkqfLG9yMXBpb2zX5dvJdYQJzPXImdj0y%7CMCOPTOUT-1715846339s%7CNONE%7CMCAID%7CNONE%7CMCSYNCSOP%7C411-19867%7CvVersion%7C5.5.0; _hjSessionUser_3400595=eyJpZCI6Ijk2YjE5NmY3LWRkMzMtNTkxYy1iY2IyLTIzMDNlMDRkNzEyNSIsImNyZWF0ZWQiOjE3MTU4MzkxNDA2MDUsImV4aXN0aW5nIjpmYWxzZX0=; _hjSession_3400595=eyJpZCI6ImFiMTJiMDJjLTFjMWYtNDJkOC1iOGYxLTAwY2Q2ZDYyMWM1ZSIsImMiOjE3MTU4MzkxNDA2MDksInMiOjAsInIiOjAsInNiIjowLCJzciI6MCwic2UiOjAsImZzIjoxLCJzcCI6MH0=; _fbp=fb.1.1715839140634.281453602; _ga=GA1.1.1944455297.1715839141; _uetsid=6467a920134911efa7d615e2de33fb03; _uetvid=6467fc40134911efa1829f1407dcc88b; WZRK_G=6f08a8df4ce04ff4b786855393b6d325; WZRK_S_679-6RK-976Z=%7B%22p%22%3A1%2C%22s%22%3A1715839141%2C%22t%22%3A1715839141%7D; s_ips=523; s_tp=3225; cto_bundle=EPlPXl9ZQjN2TTdzaTNPd0Q0dlByN3VaMFZKWVpFMmRIUXg4WFZHd0t1eUFlY3ZJZHhZOGdWZU1pa0FqeGs0VVBSczlOOXJabXAxU3g5bkRtVEh3Vm9aTE1CMWJnUDJkJTJCNFN1WWxUWmoxN0wybzBtaXVnSyUyQnVpNHh5VTBXQ1BUZHFrQmY; s_ppv=homepage%2C35%2C16%2C1123%2C2%2C6; _ga_DJ3RGVFHJN=GS1.1.1715839140.1.0.1715839149.51.0.0; s_nr30=1715839155923-New; s_sq=%5B%5BB%5D%5D
----
--Response 
HTTP/1.1 200
access-control-allow-origin: *
date: Thu, 16 May 2024 05:59:15 GMT
expires: Wed, 15 May 2024 05:59:15 GMT
last-modified: Fri, 17 May 2024 05:59:15 GMT
pragma: no-cache
p3p: CP=\"This is not a P3P policy\"
server: jag
set-cookie: s_ecid=MCMID%7C23208888194201725061814923007976880958; Path=/; Domain=croma.com; Max-Age=63072000; Expires=Sat, 16 May 2026 05:59:59 GMT;
etag: 3684736528491577344-4618688944887274297
vary: *
content-type: image/gif;charset=utf-8
content-length: 43
strict-transport-security: max-age=31536000; includeSubDomains
cache-control: no-cache, no-store, max-age=0, no-transform, private
x-xss-protection: 1; mode=block
x-content-type-options: nosniff
----

