--Request 
GET https://api.croma.com/pwagoogle/v1/getgeocode/400049?components=%27country:IN|postal_code:400049%27
Host: api.croma.com
sec-ch-ua: \"Not.A/Brand\";v=\"8\", \"Chromium\";v=\"114\"
Accept: application/json, text/plain, */*
sec-ch-ua-mobile: ?0
User-Agent: Mozilla/5.0 (X11; Linux x86_64) AppleWebKit/537.36 (KHTML, like Gecko) Chrome/114.0.0.0 Safari/537.36
sec-ch-ua-platform: \"Linux\"
Sec-Fetch-Site: same-site
Sec-Fetch-Mode: cors
Sec-Fetch-Dest: empty
Referer: https://www.croma.com/
Accept-Encoding: gzip, deflate, br
Accept-Language: en-US,en;q=0.9
Cookie: AKA_A2=A; at_check=true; AMCVS_E78F53F05EFEF21E0A495E58%40AdobeOrg=1; s_ecid=MCMID%7C23208888194201725061814923007976880958; mbox=session#895fcaa2d50341f0b4231873c20498c7#1715841000|PC#895fcaa2d50341f0b4231873c20498c7.41_0#1779083940; s_plt=NaN; s_pltp=undefined; s_cc=true; _gcl_au=1.1.1421799651.1715839140; AMCV_E78F53F05EFEF21E0A495E58%40AdobeOrg=179643557%7CMCIDTS%7C19860%7CMCMID%7C23208888194201725061814923007976880958%7CMCAAMLH-1716443939%7C12%7CMCAAMB-1716443939%7C6G1ynYcLPuiQxYZrsz_pkqfLG9yMXBpb2zX5dvJdYQJzPXImdj0y%7CMCOPTOUT-1715846339s%7CNONE%7CMCAID%7CNONE%7CMCSYNCSOP%7C411-19867%7CvVersion%7C5.5.0; _hjSessionUser_3400595=eyJpZCI6Ijk2YjE5NmY3LWRkMzMtNTkxYy1iY2IyLTIzMDNlMDRkNzEyNSIsImNyZWF0ZWQiOjE3MTU4MzkxNDA2MDUsImV4aXN0aW5nIjpmYWxzZX0=; _hjSession_3400595=eyJpZCI6ImFiMTJiMDJjLTFjMWYtNDJkOC1iOGYxLTAwY2Q2ZDYyMWM1ZSIsImMiOjE3MTU4MzkxNDA2MDksInMiOjAsInIiOjAsInNiIjowLCJzciI6MCwic2UiOjAsImZzIjoxLCJzcCI6MH0=; _fbp=fb.1.1715839140634.281453602; _ga=GA1.1.1944455297.1715839141; _uetsid=6467a920134911efa7d615e2de33fb03; _uetvid=6467fc40134911efa1829f1407dcc88b; WZRK_G=6f08a8df4ce04ff4b786855393b6d325; SameSite=None; WZRK_S_679-6RK-976Z=%7B%22p%22%3A1%2C%22s%22%3A1715839141%2C%22t%22%3A1715839141%7D; cto_bundle=EPlPXl9ZQjN2TTdzaTNPd0Q0dlByN3VaMFZKWVpFMmRIUXg4WFZHd0t1eUFlY3ZJZHhZOGdWZU1pa0FqeGs0VVBSczlOOXJabXAxU3g5bkRtVEh3Vm9aTE1CMWJnUDJkJTJCNFN1WWxUWmoxN0wybzBtaXVnSyUyQnVpNHh5VTBXQ1BUZHFrQmY; s_sq=%5B%5BB%5D%5D; ADRUM_BTa=R:22|g:78945276-169a-4d78-9d72-494ce021a1a1|n:croma_8daa6763-f095-4960-bcf6-a055aea3f7aa; ADRUM_BT1=R:22|i:81146|e:37|d:376; s_ips=612; s_tp=6035; _ga_DJ3RGVFHJN=GS1.1.1715839140.1.1.1715839161.39.0.0; s_nr30=1715839161487-New; s_ppv=plp%2C33%2C10%2C1993%2C3%2C11
----
--Response 
HTTP/1.1 200
content-type: application/json
request-context: appId=cid-v1:8a027b7f-7450-437d-9b4c-a47116067af5
content-encoding: gzip
content-length: 374
cache-control: max-age=2461182
expires: Thu, 13 Jun 2024 17:39:03 GMT
date: Thu, 16 May 2024 05:59:21 GMT
vary: Accept-Encoding
server-timing: cdn-cache; desc=HIT
server-timing: edge; dur=11
server-timing: origin; dur=0
server-timing: ak_p; desc=\"1715839161013_388943756_2294446352_1100_14137_3_0_219\";dur=1
x-content-type-options: nosniff
x-frame-options: SAMEORIGIN
----
--Request 
GET https://smetrics.croma.com/b/ss/infinitipwa/1/JS-2.25.0-LDQM/s34106277371687?AQB=1&ndh=1&pf=1&t=16%2F4%2F2024%200%3A59%3A21%204%20300&mid=23208888194201725061814923007976880958&aamlh=12&ce=UTF-8&pageName=plp&g=https%3A%2F%2Fwww.croma.com%2Fphones-wearables%2Fmobile-phones%2Fc%2F10&cc=INR&server=www.croma.com&events=event55%2Cevent72%2Cevent20%2Cevent21%2Cevent50%3Dundefined&c1=plp&v1=D%3Dmid&c2=www.croma.com%2Fphones-wearables%2Fmobile-phones%2Fc%2F10&v2=new&c3=2024-5-16%200%3A59%3A21&l3=%3Aoneplus%2012r%205g%3Aplp&c4=homepage&v4=guest%20user&v5=400049&v121=no&v131=Direct%20Call%20%2850%29%20%3A%20%5BImpression%5D%20%3A%20impression&v156=%3Aoneplus%2012r%205g%3Aplp&pe=lnk_o&pev2=impression%3A%20tracking&s=1523x650&c=24&j=1.6&v=N&k=Y&bw=790&bh=473&mcorgid=E78F53F05EFEF21E0A495E58%40AdobeOrg&AQE=1
Host: smetrics.croma.com
sec-ch-ua: \"Not.A/Brand\";v=\"8\", \"Chromium\";v=\"114\"
sec-ch-ua-mobile: ?0
User-Agent: Mozilla/5.0 (X11; Linux x86_64) AppleWebKit/537.36 (KHTML, like Gecko) Chrome/114.0.0.0 Safari/537.36
sec-ch-ua-platform: \"Linux\"
Accept: image/avif,image/webp,image/apng,image/svg+xml,image/*,*/*;q=0.8
Sec-Fetch-Site: same-site
Sec-Fetch-Mode: no-cors
Sec-Fetch-Dest: image
Referer: https://www.croma.com/
Accept-Encoding: gzip, deflate, br
Accept-Language: en-US,en;q=0.9
Cookie: AKA_A2=A; at_check=true; AMCVS_E78F53F05EFEF21E0A495E58%40AdobeOrg=1; s_ecid=MCMID%7C23208888194201725061814923007976880958; mbox=session#895fcaa2d50341f0b4231873c20498c7#1715841000|PC#895fcaa2d50341f0b4231873c20498c7.41_0#1779083940; s_plt=NaN; s_pltp=undefined; s_cc=true; _gcl_au=1.1.1421799651.1715839140; AMCV_E78F53F05EFEF21E0A495E58%40AdobeOrg=179643557%7CMCIDTS%7C19860%7CMCMID%7C23208888194201725061814923007976880958%7CMCAAMLH-1716443939%7C12%7CMCAAMB-1716443939%7C6G1ynYcLPuiQxYZrsz_pkqfLG9yMXBpb2zX5dvJdYQJzPXImdj0y%7CMCOPTOUT-1715846339s%7CNONE%7CMCAID%7CNONE%7CMCSYNCSOP%7C411-19867%7CvVersion%7C5.5.0; _hjSessionUser_3400595=eyJpZCI6Ijk2YjE5NmY3LWRkMzMtNTkxYy1iY2IyLTIzMDNlMDRkNzEyNSIsImNyZWF0ZWQiOjE3MTU4MzkxNDA2MDUsImV4aXN0aW5nIjpmYWxzZX0=; _hjSession_3400595=eyJpZCI6ImFiMTJiMDJjLTFjMWYtNDJkOC1iOGYxLTAwY2Q2ZDYyMWM1ZSIsImMiOjE3MTU4MzkxNDA2MDksInMiOjAsInIiOjAsInNiIjowLCJzciI6MCwic2UiOjAsImZzIjoxLCJzcCI6MH0=; _fbp=fb.1.1715839140634.281453602; _ga=GA1.1.1944455297.1715839141; _uetsid=6467a920134911efa7d615e2de33fb03; _uetvid=6467fc40134911efa1829f1407dcc88b; WZRK_G=6f08a8df4ce04ff4b786855393b6d325; WZRK_S_679-6RK-976Z=%7B%22p%22%3A1%2C%22s%22%3A1715839141%2C%22t%22%3A1715839141%7D; cto_bundle=EPlPXl9ZQjN2TTdzaTNPd0Q0dlByN3VaMFZKWVpFMmRIUXg4WFZHd0t1eUFlY3ZJZHhZOGdWZU1pa0FqeGs0VVBSczlOOXJabXAxU3g5bkRtVEh3Vm9aTE1CMWJnUDJkJTJCNFN1WWxUWmoxN0wybzBtaXVnSyUyQnVpNHh5VTBXQ1BUZHFrQmY; s_sq=%5B%5BB%5D%5D; s_ips=612; s_tp=6035; _ga_DJ3RGVFHJN=GS1.1.1715839140.1.1.1715839161.39.0.0; s_nr30=1715839161487-New; s_ppv=plp%2C33%2C10%2C1993%2C3%2C11
----
--Response 
HTTP/1.1 200
access-control-allow-origin: *
date: Thu, 16 May 2024 05:59:21 GMT
expires: Wed, 15 May 2024 05:59:21 GMT
last-modified: Fri, 17 May 2024 05:59:21 GMT
pragma: no-cache
p3p: CP=\"This is not a P3P policy\"
server: jag
set-cookie: s_ecid=MCMID%7C23208888194201725061814923007976880958; Path=/; Domain=croma.com; Max-Age=63072000; Expires=Sat, 16 May 2026 05:59:59 GMT;
etag: 3684736541630332928-4618554366411370182
vary: *
content-type: image/gif;charset=utf-8
content-length: 43
strict-transport-security: max-age=31536000; includeSubDomains
cache-control: no-cache, no-store, max-age=0, no-transform, private
x-xss-protection: 1; mode=block
x-content-type-options: nosniff
----
--Request 
GET https://smetrics.croma.com/b/ss/infinitipwa/1/JS-2.25.0-LDQM/s39349590579082?AQB=1&ndh=1&pf=1&t=16%2F4%2F2024%200%3A59%3A21%204%20300&mid=23208888194201725061814923007976880958&aamlh=12&ce=UTF-8&pageName=plp&g=https%3A%2F%2Fwww.croma.com%2Fphones-wearables%2Fmobile-phones%2Fc%2F10&cc=INR&server=www.croma.com&events=event55%2Cevent72%2Cevent20%2Cevent21%2Cevent50%3Dundefined&c1=plp&v1=D%3Dmid&c2=www.croma.com%2Fphones-wearables%2Fmobile-phones%2Fc%2F10&v2=new&c3=2024-5-16%200%3A59%3A21&l3=%3Aredmi%20note%2013%3Aplp&c4=homepage&v4=guest%20user&v5=400049&v121=no&v131=Direct%20Call%20%2850%29%20%3A%20%5BImpression%5D%20%3A%20impression&v156=%3Aredmi%20note%2013%3Aplp&pe=lnk_o&pev2=impression%3A%20tracking&s=1523x650&c=24&j=1.6&v=N&k=Y&bw=790&bh=473&mcorgid=E78F53F05EFEF21E0A495E58%40AdobeOrg&AQE=1
Host: smetrics.croma.com
sec-ch-ua: \"Not.A/Brand\";v=\"8\", \"Chromium\";v=\"114\"
sec-ch-ua-mobile: ?0
User-Agent: Mozilla/5.0 (X11; Linux x86_64) AppleWebKit/537.36 (KHTML, like Gecko) Chrome/114.0.0.0 Safari/537.36
sec-ch-ua-platform: \"Linux\"
Accept: image/avif,image/webp,image/apng,image/svg+xml,image/*,*/*;q=0.8
Sec-Fetch-Site: same-site
Sec-Fetch-Mode: no-cors
Sec-Fetch-Dest: image
Referer: https://www.croma.com/
Accept-Encoding: gzip, deflate, br
Accept-Language: en-US,en;q=0.9
Cookie: AKA_A2=A; at_check=true; AMCVS_E78F53F05EFEF21E0A495E58%40AdobeOrg=1; s_ecid=MCMID%7C23208888194201725061814923007976880958; mbox=session#895fcaa2d50341f0b4231873c20498c7#1715841000|PC#895fcaa2d50341f0b4231873c20498c7.41_0#1779083940; s_plt=NaN; s_pltp=undefined; s_cc=true; _gcl_au=1.1.1421799651.1715839140; AMCV_E78F53F05EFEF21E0A495E58%40AdobeOrg=179643557%7CMCIDTS%7C19860%7CMCMID%7C23208888194201725061814923007976880958%7CMCAAMLH-1716443939%7C12%7CMCAAMB-1716443939%7C6G1ynYcLPuiQxYZrsz_pkqfLG9yMXBpb2zX5dvJdYQJzPXImdj0y%7CMCOPTOUT-1715846339s%7CNONE%7CMCAID%7CNONE%7CMCSYNCSOP%7C411-19867%7CvVersion%7C5.5.0; _hjSessionUser_3400595=eyJpZCI6Ijk2YjE5NmY3LWRkMzMtNTkxYy1iY2IyLTIzMDNlMDRkNzEyNSIsImNyZWF0ZWQiOjE3MTU4MzkxNDA2MDUsImV4aXN0aW5nIjpmYWxzZX0=; _hjSession_3400595=eyJpZCI6ImFiMTJiMDJjLTFjMWYtNDJkOC1iOGYxLTAwY2Q2ZDYyMWM1ZSIsImMiOjE3MTU4MzkxNDA2MDksInMiOjAsInIiOjAsInNiIjowLCJzciI6MCwic2UiOjAsImZzIjoxLCJzcCI6MH0=; _fbp=fb.1.1715839140634.281453602; _ga=GA1.1.1944455297.1715839141; _uetsid=6467a920134911efa7d615e2de33fb03; _uetvid=6467fc40134911efa1829f1407dcc88b; WZRK_G=6f08a8df4ce04ff4b786855393b6d325; WZRK_S_679-6RK-976Z=%7B%22p%22%3A1%2C%22s%22%3A1715839141%2C%22t%22%3A1715839141%7D; cto_bundle=EPlPXl9ZQjN2TTdzaTNPd0Q0dlByN3VaMFZKWVpFMmRIUXg4WFZHd0t1eUFlY3ZJZHhZOGdWZU1pa0FqeGs0VVBSczlOOXJabXAxU3g5bkRtVEh3Vm9aTE1CMWJnUDJkJTJCNFN1WWxUWmoxN0wybzBtaXVnSyUyQnVpNHh5VTBXQ1BUZHFrQmY; s_sq=%5B%5BB%5D%5D; s_ips=612; s_tp=6035; _ga_DJ3RGVFHJN=GS1.1.1715839140.1.1.1715839161.39.0.0; s_nr30=1715839161487-New; s_ppv=plp%2C33%2C10%2C1993%2C3%2C11
----
--Response 
HTTP/1.1 200
access-control-allow-origin: *
date: Thu, 16 May 2024 05:59:21 GMT
expires: Wed, 15 May 2024 05:59:21 GMT
last-modified: Fri, 17 May 2024 05:59:21 GMT
pragma: no-cache
p3p: CP=\"This is not a P3P policy\"
server: jag
set-cookie: s_ecid=MCMID%7C23208888194201725061814923007976880958; Path=/; Domain=croma.com; Max-Age=63072000; Expires=Sat, 16 May 2026 05:59:59 GMT;
etag: 3684736542031708160-4618529871672495982
vary: *
content-type: image/gif;charset=utf-8
content-length: 43
strict-transport-security: max-age=31536000; includeSubDomains
cache-control: no-cache, no-store, max-age=0, no-transform, private
x-xss-protection: 1; mode=block
x-content-type-options: nosniff
----
--Request 
GET https://smetrics.croma.com/b/ss/infinitipwa/1/JS-2.25.0-LDQM/s39621028528443?AQB=1&ndh=1&pf=1&t=16%2F4%2F2024%200%3A59%3A21%204%20300&mid=23208888194201725061814923007976880958&aamlh=12&ce=UTF-8&pageName=plp&g=https%3A%2F%2Fwww.croma.com%2Fphones-wearables%2Fmobile-phones%2Fc%2F10&cc=INR&server=www.croma.com&events=event55%2Cevent72%2Cevent20%2Cevent21%2Cevent50%3Dundefined&c1=plp&v1=D%3Dmid&c2=www.croma.com%2Fphones-wearables%2Fmobile-phones%2Fc%2F10&v2=new&c3=2024-5-16%200%3A59%3A21&l3=%3Anothing%20phone%202%205g%2012gb256gb%3Aplp&c4=homepage&v4=guest%20user&v5=400049&v121=no&v131=Direct%20Call%20%2850%29%20%3A%20%5BImpression%5D%20%3A%20impression&v156=%3Anothing%20phone%202%205g%2012gb256gb%3Aplp&pe=lnk_o&pev2=impression%3A%20tracking&s=1523x650&c=24&j=1.6&v=N&k=Y&bw=790&bh=473&mcorgid=E78F53F05EFEF21E0A495E58%40AdobeOrg&AQE=1
Host: smetrics.croma.com
sec-ch-ua: \"Not.A/Brand\";v=\"8\", \"Chromium\";v=\"114\"
sec-ch-ua-mobile: ?0
User-Agent: Mozilla/5.0 (X11; Linux x86_64) AppleWebKit/537.36 (KHTML, like Gecko) Chrome/114.0.0.0 Safari/537.36
sec-ch-ua-platform: \"Linux\"
Accept: image/avif,image/webp,image/apng,image/svg+xml,image/*,*/*;q=0.8
Sec-Fetch-Site: same-site
Sec-Fetch-Mode: no-cors
Sec-Fetch-Dest: image
Referer: https://www.croma.com/
Accept-Encoding: gzip, deflate, br
Accept-Language: en-US,en;q=0.9
Cookie: AKA_A2=A; at_check=true; AMCVS_E78F53F05EFEF21E0A495E58%40AdobeOrg=1; s_ecid=MCMID%7C23208888194201725061814923007976880958; mbox=session#895fcaa2d50341f0b4231873c20498c7#1715841000|PC#895fcaa2d50341f0b4231873c20498c7.41_0#1779083940; s_plt=NaN; s_pltp=undefined; s_cc=true; _gcl_au=1.1.1421799651.1715839140; AMCV_E78F53F05EFEF21E0A495E58%40AdobeOrg=179643557%7CMCIDTS%7C19860%7CMCMID%7C23208888194201725061814923007976880958%7CMCAAMLH-1716443939%7C12%7CMCAAMB-1716443939%7C6G1ynYcLPuiQxYZrsz_pkqfLG9yMXBpb2zX5dvJdYQJzPXImdj0y%7CMCOPTOUT-1715846339s%7CNONE%7CMCAID%7CNONE%7CMCSYNCSOP%7C411-19867%7CvVersion%7C5.5.0; _hjSessionUser_3400595=eyJpZCI6Ijk2YjE5NmY3LWRkMzMtNTkxYy1iY2IyLTIzMDNlMDRkNzEyNSIsImNyZWF0ZWQiOjE3MTU4MzkxNDA2MDUsImV4aXN0aW5nIjpmYWxzZX0=; _hjSession_3400595=eyJpZCI6ImFiMTJiMDJjLTFjMWYtNDJkOC1iOGYxLTAwY2Q2ZDYyMWM1ZSIsImMiOjE3MTU4MzkxNDA2MDksInMiOjAsInIiOjAsInNiIjowLCJzciI6MCwic2UiOjAsImZzIjoxLCJzcCI6MH0=; _fbp=fb.1.1715839140634.281453602; _ga=GA1.1.1944455297.1715839141; _uetsid=6467a920134911efa7d615e2de33fb03; _uetvid=6467fc40134911efa1829f1407dcc88b; WZRK_G=6f08a8df4ce04ff4b786855393b6d325; WZRK_S_679-6RK-976Z=%7B%22p%22%3A1%2C%22s%22%3A1715839141%2C%22t%22%3A1715839141%7D; cto_bundle=EPlPXl9ZQjN2TTdzaTNPd0Q0dlByN3VaMFZKWVpFMmRIUXg4WFZHd0t1eUFlY3ZJZHhZOGdWZU1pa0FqeGs0VVBSczlOOXJabXAxU3g5bkRtVEh3Vm9aTE1CMWJnUDJkJTJCNFN1WWxUWmoxN0wybzBtaXVnSyUyQnVpNHh5VTBXQ1BUZHFrQmY; s_sq=%5B%5BB%5D%5D; s_ips=612; s_tp=6035; _ga_DJ3RGVFHJN=GS1.1.1715839140.1.1.1715839161.39.0.0; s_nr30=1715839161487-New; s_ppv=plp%2C33%2C10%2C1993%2C3%2C11
----
--Response 
HTTP/1.1 200
access-control-allow-origin: *
date: Thu, 16 May 2024 05:59:21 GMT
expires: Wed, 15 May 2024 05:59:21 GMT
last-modified: Fri, 17 May 2024 05:59:21 GMT
pragma: no-cache
p3p: CP=\"This is not a P3P policy\"
server: jag
set-cookie: s_ecid=MCMID%7C23208888194201725061814923007976880958; Path=/; Domain=croma.com; Max-Age=63072000; Expires=Sat, 16 May 2026 05:59:59 GMT;
etag: 3684736542184341504-4618425892664660318
vary: *
content-type: image/gif;charset=utf-8
content-length: 43
strict-transport-security: max-age=31536000; includeSubDomains
cache-control: no-cache, no-store, max-age=0, no-transform, private
x-xss-protection: 1; mode=block
x-content-type-options: nosniff
----



