--Request 
POST https://10.10.30.9:8003/test_rum?s=001403978702638809130&p=1&m=0&op=useraction&pi=1&CavStore=-1&pid=-1&d=0|0&lts=326889366&nvcounter=4
Host: 10.10.30.9:8003
sec-ch-ua: \"Not.A/Brand\";v=\"8\", \"Chromium\";v=\"114\"
sec-ch-ua-platform: \"Linux\"
sec-ch-ua-mobile: ?0
User-Agent: Mozilla/5.0 (X11; Linux x86_64) AppleWebKit/537.36 (KHTML, like Gecko) Chrome/114.0.0.0 Safari/537.36
Content-Type: text/plain;charset=UTF-8
Accept: */*
Sec-Fetch-Site: same-origin
Sec-Fetch-Mode: no-cors
Sec-Fetch-Dest: empty
Referer: https://10.10.30.9:8003/tours/index.html
Accept-Encoding: gzip, deflate, br
Accept-Language: en-US,en;q=0.9
Cookie: CavVI=001403978702638809130; CavSF=2,,1:0:0,1715423665055,0|,,,,1,,,1,,,,; CavNVC=001403978702638809130-1-326889265-1
----
 POSTDATA 001403978702638809130|-1|1|326889366188|0|1001||-2||||0|0|1521|527|||1000|1000||{}|

--Response 
HTTP/1.1 200 OK
Content-Length: 0000000001
Content-Type: text/plain
Access-Control-Allow-Origin: *
Timing-Allow-Origin: *
Access-Control-Allow-Credentials: true
Access-Control-Allow-Methods: POST, PUT, DELETE, GET, OPTIONS
Access-Control-Request-Headers: *
Access-Control-Allow-Headers: Origin, X-Requested-With, Content-Type, Accept, Authorization, Content-Encoding
Access-Control-Max-Age: 300
cache-control: no-store
Connection: Keep-Alive
----
--Request 
GET https://10.10.30.9:8003/tours/Merc10-dev/images/banner_animated.gif
Host: 10.10.30.9:8003
sec-ch-ua: \"Not.A/Brand\";v=\"8\", \"Chromium\";v=\"114\"
sec-ch-ua-mobile: ?0
User-Agent: Mozilla/5.0 (X11; Linux x86_64) AppleWebKit/537.36 (KHTML, like Gecko) Chrome/114.0.0.0 Safari/537.36
sec-ch-ua-platform: \"Linux\"
Accept: image/avif,image/webp,image/apng,image/svg+xml,image/*,*/*;q=0.8
Sec-Fetch-Site: same-origin
Sec-Fetch-Mode: no-cors
Sec-Fetch-Dest: image
Referer: https://10.10.30.9:8003/cgi-bin/login?userSession=75893.0884568651DQADHfApHDHfcDtccpfAttcf&username=guest&password=guest&login.x=55&login.y=10&JSFormSubmit=off
Accept-Encoding: gzip, deflate, br
Accept-Language: en-US,en;q=0.9
Cookie: CavVI=001403978702638809130; CavSF=2,,1:0:0,1715423665055,0|,,,,1,,,1,,,,; CavNVC=001403978702638809130-1-326889265-1
----
--Response 
HTTP/1.1 200 OK
Content-Length: 16522
Content-Type: image/gif
Connection: Keep-Alive
----
--Request 
GET https://10.10.30.9:8003/tours/Merc10-dev/images/sun_swede.gif
Host: 10.10.30.9:8003
sec-ch-ua: \"Not.A/Brand\";v=\"8\", \"Chromium\";v=\"114\"
sec-ch-ua-mobile: ?0
User-Agent: Mozilla/5.0 (X11; Linux x86_64) AppleWebKit/537.36 (KHTML, like Gecko) Chrome/114.0.0.0 Safari/537.36
sec-ch-ua-platform: \"Linux\"
Accept: image/avif,image/webp,image/apng,image/svg+xml,image/*,*/*;q=0.8
Sec-Fetch-Site: same-origin
Sec-Fetch-Mode: no-cors
Sec-Fetch-Dest: image
Referer: https://10.10.30.9:8003/cgi-bin/login?userSession=75893.0884568651DQADHfApHDHfcDtccpfAttcf&username=guest&password=guest&login.x=55&login.y=10&JSFormSubmit=off
Accept-Encoding: gzip, deflate, br
Accept-Language: en-US,en;q=0.9
Cookie: CavVI=001403978702638809130; CavSF=2,,1:0:0,1715423665055,0|,,,,1,,,1,,,,; CavNVC=001403978702638809130-1-326889265-1
----
--Response 
HTTP/1.1 200 OK
Content-Length: 4125
Content-Type: image/gif
Connection: Keep-Alive
----
--Request 
GET https://10.10.30.9:8003/tours/Merc10-dev/images/flights.gif
Host: 10.10.30.9:8003
sec-ch-ua: \"Not.A/Brand\";v=\"8\", \"Chromium\";v=\"114\"
sec-ch-ua-mobile: ?0
User-Agent: Mozilla/5.0 (X11; Linux x86_64) AppleWebKit/537.36 (KHTML, like Gecko) Chrome/114.0.0.0 Safari/537.36
sec-ch-ua-platform: \"Linux\"
Accept: image/avif,image/webp,image/apng,image/svg+xml,image/*,*/*;q=0.8
Sec-Fetch-Site: same-origin
Sec-Fetch-Mode: no-cors
Sec-Fetch-Dest: image
Referer: https://10.10.30.9:8003/cgi-bin/login?userSession=75893.0884568651DQADHfApHDHfcDtccpfAttcf&username=guest&password=guest&login.x=55&login.y=10&JSFormSubmit=off
Accept-Encoding: gzip, deflate, br
Accept-Language: en-US,en;q=0.9
Cookie: CavVI=001403978702638809130; CavSF=2,,1:0:0,1715423665055,0|,,,,1,,,1,,,,; CavNVC=001403978702638809130-1-326889265-1
----
--Response 
HTTP/1.1 200 OK
Content-Length: 1519
Content-Type: image/gif
Connection: Keep-Alive
----
--Request 
GET https://10.10.30.9:8003/tours/Merc10-dev/images/home.gif
Host: 10.10.30.9:8003
sec-ch-ua: \"Not.A/Brand\";v=\"8\", \"Chromium\";v=\"114\"
sec-ch-ua-mobile: ?0
User-Agent: Mozilla/5.0 (X11; Linux x86_64) AppleWebKit/537.36 (KHTML, like Gecko) Chrome/114.0.0.0 Safari/537.36
sec-ch-ua-platform: \"Linux\"
Accept: image/avif,image/webp,image/apng,image/svg+xml,image/*,*/*;q=0.8
Sec-Fetch-Site: same-origin
Sec-Fetch-Mode: no-cors
Sec-Fetch-Dest: image
Referer: https://10.10.30.9:8003/cgi-bin/login?userSession=75893.0884568651DQADHfApHDHfcDtccpfAttcf&username=guest&password=guest&login.x=55&login.y=10&JSFormSubmit=off
Accept-Encoding: gzip, deflate, br
Accept-Language: en-US,en;q=0.9
Cookie: CavVI=001403978702638809130; CavSF=2,,1:0:0,1715423665055,0|,,,,1,,,1,,,,; CavNVC=001403978702638809130-1-326889265-1
----
--Response 
HTTP/1.1 200 OK
Content-Length: 1268
Content-Type: image/gif
Connection: Keep-Alive
----
--Request 
GET https://10.10.30.9:8003/tours/Merc10-dev/images/signoff.gif
Host: 10.10.30.9:8003
sec-ch-ua: \"Not.A/Brand\";v=\"8\", \"Chromium\";v=\"114\"
sec-ch-ua-mobile: ?0
User-Agent: Mozilla/5.0 (X11; Linux x86_64) AppleWebKit/537.36 (KHTML, like Gecko) Chrome/114.0.0.0 Safari/537.36
sec-ch-ua-platform: \"Linux\"
Accept: image/avif,image/webp,image/apng,image/svg+xml,image/*,*/*;q=0.8
Sec-Fetch-Site: same-origin
Sec-Fetch-Mode: no-cors
Sec-Fetch-Dest: image
Referer: https://10.10.30.9:8003/cgi-bin/login?userSession=75893.0884568651DQADHfApHDHfcDtccpfAttcf&username=guest&password=guest&login.x=55&login.y=10&JSFormSubmit=off
Accept-Encoding: gzip, deflate, br
Accept-Language: en-US,en;q=0.9
Cookie: CavVI=001403978702638809130; CavSF=2,,1:0:0,1715423665055,0|,,,,1,,,1,,,,; CavNVC=001403978702638809130-1-326889265-1
----
--Response 
HTTP/1.1 200 OK
Content-Length: 1260
Content-Type: image/gif
Connection: Keep-Alive
----
--Request 
GET https://10.10.30.9:8003/tours/images/banner_merctur.jpg
Host: 10.10.30.9:8003
sec-ch-ua: \"Not.A/Brand\";v=\"8\", \"Chromium\";v=\"114\"
sec-ch-ua-mobile: ?0
User-Agent: Mozilla/5.0 (X11; Linux x86_64) AppleWebKit/537.36 (KHTML, like Gecko) Chrome/114.0.0.0 Safari/537.36
sec-ch-ua-platform: \"Linux\"
Accept: image/avif,image/webp,image/apng,image/svg+xml,image/*,*/*;q=0.8
Sec-Fetch-Site: same-origin
Sec-Fetch-Mode: no-cors
Sec-Fetch-Dest: image
Referer: https://10.10.30.9:8003/cgi-bin/login?userSession=75893.0884568651DQADHfApHDHfcDtccpfAttcf&username=guest&password=guest&login.x=55&login.y=10&JSFormSubmit=off
Accept-Encoding: gzip, deflate, br
Accept-Language: en-US,en;q=0.9
Cookie: CavVI=001403978702638809130; CavSF=2,,1:0:0,1715423665055,0|,,,,1,,,1,,,,; CavNVC=001403978702638809130-1-326889265-1
----
--Response 
HTTP/1.1 200 OK
Content-Length: 22548
Content-Type: image/jpeg
Connection: Keep-Alive
----
--Request 
GET https://10.10.30.9:8003/tours/vep/images/velocigen.gif
Host: 10.10.30.9:8003
sec-ch-ua: \"Not.A/Brand\";v=\"8\", \"Chromium\";v=\"114\"
sec-ch-ua-mobile: ?0
User-Agent: Mozilla/5.0 (X11; Linux x86_64) AppleWebKit/537.36 (KHTML, like Gecko) Chrome/114.0.0.0 Safari/537.36
sec-ch-ua-platform: \"Linux\"
Accept: image/avif,image/webp,image/apng,image/svg+xml,image/*,*/*;q=0.8
Sec-Fetch-Site: same-origin
Sec-Fetch-Mode: no-cors
Sec-Fetch-Dest: image
Referer: https://10.10.30.9:8003/cgi-bin/login?userSession=75893.0884568651DQADHfApHDHfcDtccpfAttcf&username=guest&password=guest&login.x=55&login.y=10&JSFormSubmit=off
Accept-Encoding: gzip, deflate, br
Accept-Language: en-US,en;q=0.9
Cookie: CavVI=001403978702638809130; CavSF=2,,1:0:0,1715423665055,0|,,,,1,,,1,,,,; CavNVC=001403978702638809130-1-326889265-1
----
--Response 
HTTP/1.1 200 OK
Content-Length: 2018
Content-Type: image/gif
Connection: Keep-Alive
----
--Request 
GET https://10.10.30.9:8003/favicon.ico
Host: 10.10.30.9:8003
sec-ch-ua: \"Not.A/Brand\";v=\"8\", \"Chromium\";v=\"114\"
sec-ch-ua-mobile: ?0
User-Agent: Mozilla/5.0 (X11; Linux x86_64) AppleWebKit/537.36 (KHTML, like Gecko) Chrome/114.0.0.0 Safari/537.36
sec-ch-ua-platform: \"Linux\"
Accept: image/avif,image/webp,image/apng,image/svg+xml,image/*,*/*;q=0.8
Sec-Fetch-Site: same-origin
Sec-Fetch-Mode: no-cors
Sec-Fetch-Dest: image
Referer: https://10.10.30.9:8003/cgi-bin/login?userSession=75893.0884568651DQADHfApHDHfcDtccpfAttcf&username=guest&password=guest&login.x=55&login.y=10&JSFormSubmit=off
Accept-Encoding: gzip, deflate, br
Accept-Language: en-US,en;q=0.9
Cookie: CavVI=001403978702638809130; CavSF=2,,1:0:0,1715423665055,0|,,,,1,,,1,,,,; CavNVC=001403978702638809130-1-326889265-1
----
--Response 
HTTP/1.1 200 OK
Content-Length: 1406
Connection: Keep-Alive
----

