--Request 
GET https://10.10.30.9:8003/cgi-bin/welcome
Host: 10.10.30.9:8003
sec-ch-ua: \"Not.A/Brand\";v=\"8\", \"Chromium\";v=\"114\"
sec-ch-ua-mobile: ?0
sec-ch-ua-platform: \"Linux\"
Upgrade-Insecure-Requests: 1
User-Agent: Mozilla/5.0 (X11; Linux x86_64) AppleWebKit/537.36 (KHTML, like Gecko) Chrome/114.0.0.0 Safari/537.36
Accept: text/html,application/xhtml+xml,application/xml;q=0.9,image/avif,image/webp,image/apng,*/*;q=0.8,application/signed-exchange;v=b3;q=0.7
Sec-Fetch-Site: same-origin
Sec-Fetch-Mode: navigate
Sec-Fetch-User: ?1
Sec-Fetch-Dest: document
Referer: https://10.10.30.9:8003/cgi-bin/findflight?firstName=Tiger&lastName=Scott&address1=4261+Stevenson+Blvd.&address2=Fremont%2C+CA+94538&pass1=Scott+Tiger&creditCard=&expDate=&oldCCOption=&numPassengers=1&seatType=Coach&seatPref=None&outboundFlight=001%7C0%7C05-12-2024&advanceDiscount=&buyFlights.x=59&buyFlights.y=15&.cgifields=saveCC
Accept-Encoding: gzip, deflate, br
Accept-Language: en-US,en;q=0.9
Cookie: CavVI=001403978702638809130; CavSF=2,,1:0:0,1715423665055,0|,,,,1,,,1,,,,; CavNVC=001403978702638809130-1-326889265-1
----
--Response 
HTTP/1.1 200 OK
Content-length: 0000002957
Connection: Keep-Alive
Content-type: text/html
----
--Request 
GET https://10.10.30.9:8003/tours/Merc10-dev/images/banner_animated.gif
Host: 10.10.30.9:8003
sec-ch-ua: \"Not.A/Brand\";v=\"8\", \"Chromium\";v=\"114\"
sec-ch-ua-mobile: ?0
User-Agent: Mozilla/5.0 (X11; Linux x86_64) AppleWebKit/537.36 (KHTML, like Gecko) Chrome/114.0.0.0 Safari/537.36
sec-ch-ua-platform: \"Linux\"
Accept: image/avif,image/webp,image/apng,image/svg+xml,image/*,*/*;q=0.8
Sec-Fetch-Site: same-origin
Sec-Fetch-Mode: no-cors
Sec-Fetch-Dest: image
Referer: https://10.10.30.9:8003/cgi-bin/welcome
Accept-Encoding: gzip, deflate, br
Accept-Language: en-US,en;q=0.9
Cookie: CavVI=001403978702638809130; CavSF=2,,1:0:0,1715423665055,0|,,,,1,,,1,,,,; CavNVC=001403978702638809130-1-326889265-1
----
--Response 
HTTP/1.1 200 OK
Content-Length: 16522
Content-Type: image/gif
Connection: Keep-Alive
----
--Request 
GET https://10.10.30.9:8003/tours/Merc10-dev/images/sun_swede.gif
Host: 10.10.30.9:8003
sec-ch-ua: \"Not.A/Brand\";v=\"8\", \"Chromium\";v=\"114\"
sec-ch-ua-mobile: ?0
User-Agent: Mozilla/5.0 (X11; Linux x86_64) AppleWebKit/537.36 (KHTML, like Gecko) Chrome/114.0.0.0 Safari/537.36
sec-ch-ua-platform: \"Linux\"
Accept: image/avif,image/webp,image/apng,image/svg+xml,image/*,*/*;q=0.8
Sec-Fetch-Site: same-origin
Sec-Fetch-Mode: no-cors
Sec-Fetch-Dest: image
Referer: https://10.10.30.9:8003/cgi-bin/welcome
Accept-Encoding: gzip, deflate, br
Accept-Language: en-US,en;q=0.9
Cookie: CavVI=001403978702638809130; CavSF=2,,1:0:0,1715423665055,0|,,,,1,,,1,,,,; CavNVC=001403978702638809130-1-326889265-1
----
--Response 
HTTP/1.1 200 OK
Content-Length: 4125
Content-Type: image/gif
Connection: Keep-Alive
----
--Request 
GET https://10.10.30.9:8003/tours/Merc10-dev/images/login.gif
Host: 10.10.30.9:8003
sec-ch-ua: \"Not.A/Brand\";v=\"8\", \"Chromium\";v=\"114\"
sec-ch-ua-mobile: ?0
User-Agent: Mozilla/5.0 (X11; Linux x86_64) AppleWebKit/537.36 (KHTML, like Gecko) Chrome/114.0.0.0 Safari/537.36
sec-ch-ua-platform: \"Linux\"
Accept: image/avif,image/webp,image/apng,image/svg+xml,image/*,*/*;q=0.8
Sec-Fetch-Site: same-origin
Sec-Fetch-Mode: no-cors
Sec-Fetch-Dest: image
Referer: https://10.10.30.9:8003/cgi-bin/welcome
Accept-Encoding: gzip, deflate, br
Accept-Language: en-US,en;q=0.9
Cookie: CavVI=001403978702638809130; CavSF=2,,1:0:0,1715423665055,0|,,,,1,,,1,,,,; CavNVC=001403978702638809130-1-326889265-1
----
--Response 
HTTP/1.1 200 OK
Content-Length: 1323
Content-Type: image/gif
Connection: Keep-Alive
----
--Request 
GET https://10.10.30.9:8003/tours/images/banner_merctur.jpg
Host: 10.10.30.9:8003
sec-ch-ua: \"Not.A/Brand\";v=\"8\", \"Chromium\";v=\"114\"
sec-ch-ua-mobile: ?0
User-Agent: Mozilla/5.0 (X11; Linux x86_64) AppleWebKit/537.36 (KHTML, like Gecko) Chrome/114.0.0.0 Safari/537.36
sec-ch-ua-platform: \"Linux\"
Accept: image/avif,image/webp,image/apng,image/svg+xml,image/*,*/*;q=0.8
Sec-Fetch-Site: same-origin
Sec-Fetch-Mode: no-cors
Sec-Fetch-Dest: image
Referer: https://10.10.30.9:8003/cgi-bin/welcome
Accept-Encoding: gzip, deflate, br
Accept-Language: en-US,en;q=0.9
Cookie: CavVI=001403978702638809130; CavSF=2,,1:0:0,1715423665055,0|,,,,1,,,1,,,,; CavNVC=001403978702638809130-1-326889265-1
----
--Response 
HTTP/1.1 200 OK
Content-Length: 22548
Content-Type: image/jpeg
Connection: Keep-Alive
----
--Request 
GET https://10.10.30.9:8003/tours/vep/images/velocigen.gif
Host: 10.10.30.9:8003
sec-ch-ua: \"Not.A/Brand\";v=\"8\", \"Chromium\";v=\"114\"
sec-ch-ua-mobile: ?0
User-Agent: Mozilla/5.0 (X11; Linux x86_64) AppleWebKit/537.36 (KHTML, like Gecko) Chrome/114.0.0.0 Safari/537.36
sec-ch-ua-platform: \"Linux\"
Accept: image/avif,image/webp,image/apng,image/svg+xml,image/*,*/*;q=0.8
Sec-Fetch-Site: same-origin
Sec-Fetch-Mode: no-cors
Sec-Fetch-Dest: image
Referer: https://10.10.30.9:8003/cgi-bin/welcome
Accept-Encoding: gzip, deflate, br
Accept-Language: en-US,en;q=0.9
Cookie: CavVI=001403978702638809130; CavSF=2,,1:0:0,1715423665055,0|,,,,1,,,1,,,,; CavNVC=001403978702638809130-1-326889265-1
----
--Response 
HTTP/1.1 200 OK
Content-Length: 2018
Content-Type: image/gif
Connection: Keep-Alive
----
--Request 
GET https://10.10.30.9:8003/favicon.ico
Host: 10.10.30.9:8003
sec-ch-ua: \"Not.A/Brand\";v=\"8\", \"Chromium\";v=\"114\"
sec-ch-ua-mobile: ?0
User-Agent: Mozilla/5.0 (X11; Linux x86_64) AppleWebKit/537.36 (KHTML, like Gecko) Chrome/114.0.0.0 Safari/537.36
sec-ch-ua-platform: \"Linux\"
Accept: image/avif,image/webp,image/apng,image/svg+xml,image/*,*/*;q=0.8
Sec-Fetch-Site: same-origin
Sec-Fetch-Mode: no-cors
Sec-Fetch-Dest: image
Referer: https://10.10.30.9:8003/cgi-bin/welcome
Accept-Encoding: gzip, deflate, br
Accept-Language: en-US,en;q=0.9
Cookie: CavVI=001403978702638809130; CavSF=2,,1:0:0,1715423665055,0|,,,,1,,,1,,,,; CavNVC=001403978702638809130-1-326889265-1
----
--Response 
HTTP/1.1 200 OK
Content-Length: 1406
Connection: Keep-Alive
----

