--Request 
POST https://bom-col.eum-appdynamics.com/eumcollector/beacons/browser/v1/BO-AAB-FBK/adrum
Host: bom-col.eum-appdynamics.com
sec-ch-ua: \"Not.A/Brand\";v=\"8\", \"Chromium\";v=\"114\"
sec-ch-ua-platform: \"Linux\"
sec-ch-ua-mobile: ?0
User-Agent: Mozilla/5.0 (X11; Linux x86_64) AppleWebKit/537.36 (KHTML, like Gecko) Chrome/114.0.0.0 Safari/537.36
Content-type: text/plain
Accept: */*
Sec-Fetch-Site: cross-site
Sec-Fetch-Mode: cors
Sec-Fetch-Dest: empty
Referer: https://www.croma.com/
Accept-Encoding: gzip, deflate, br
Accept-Language: en-US,en;q=0.9
----
 POSTDATA {"vr":"23.10.1.4359","dt":"R","rg":"0","es":[{"eg":"1","et":2,"eu":"0://1/2/3/4/5?6","ts":1715839205463,"mg":"0","au":"0://7/8/9/10","at":0,"pp":1,"mx":{"PLC":1,"FBT":2067,"DDT":1,"DPT":0,"PLT":2068,"ARE":0},"md":"GET","xs":200,"si":35},{"eg":"2","et":2,"eu":"0://11/12/13/14/15/16/17","ts":1715839207207,"mg":"0","au":"0://7/8/9/10","at":0,"pp":1,"mx":{"PLC":1,"FBT":346,"DDT":1,"DPT":0,"PLT":347,"ARE":0},"md":"POST","xs":200,"si":36},{"eg":"3","et":2,"eu":"0://1/18/3/4/19?20","ts":1715839207623,"mg":"0","au":"0://7/8/9/10","at":0,"pp":1,"mx":{"PLC":1,"FBT":356,"DDT":0,"DPT":0,"PLT":356,"ARE":0},"md":"GET","xs":200,"si":37},{"eg":"4","et":2,"eu":"0://21/22/23/24/25","ts":1715839205436,"mg":"0","au":"0://7/8/9/10","at":0,"pp":1,"mx":{"PLC":1,"FBT":2303,"DDT":277,"DPT":0,"PLT":2580,"ARE":0},"md":"POST","xs":200,"si":38},{"eg":"5","et":2,"eu":"0://21/26/25/4","ts":1715839205469,"mg":"0","au":"0://7/8/9/10","at":0,"pp":1,"mx":{"PLC":1,"FBT":2321,"DDT":248,"DPT":0,"PLT":2569,"ARE":0},"md":"POST","xs":200,"si":39},{"eg":"6","et":2,"eu":"0://21/26/25/4","ts":1715839206062,"mg":"0","au":"0://7/8/9/10","at":0,"pp":1,"mx":{"PLC":1,"FBT":1732,"DDT":244,"DPT":0,"PLT":1976,"ARE":0},"md":"POST","xs":200,"si":40},{"eg":"7","et":2,"eu":"0://27/28?29","ts":1715839207309,"mg":"0","au":"0://7/8/9/10","at":0,"pp":1,"mx":{"PLC":1,"FBT":732,"DDT":0,"DPT":0,"PLT":732,"ARE":0},"md":"GET","xs":200,"si":41},{"eg":"8","et":2,"eu":"0://30/31/19","ts":1715839208185,"mg":"0","au":"0://7/8/9/10","at":0,"pp":1,"mx":{"PLC":1,"FBT":430,"DDT":3,"DPT":0,"PLT":433,"ARE":0},"md":"POST","xs":202,"si":42},{"eg":"9","et":2,"eu":"0://21/26/25/4","ts":1715839208474,"mg":"0","au":"0://7/8/9/10","at":0,"pp":1,"mx":{"PLC":1,"FBT":200,"DDT":6,"DPT":0,"PLT":206,"ARE":0},"md":"POST","xs":200,"si":43},{"eg":"10","et":2,"eu":"0://21/26/25/4","ts":1715839208478,"mg":"0","au":"0://7/8/9/10","at":0,"pp":1,"mx":{"PLC":1,"FBT":201,"DDT":4,"DPT":0,"PLT":205,"ARE":0},"md":"POST","xs":200,"si":44},{"eg":"0","et":0,"eu":"0://7/8/9/10","ts":1715839201889,"mc":{"PLT":6721,"FBT":1960,"FET":4761,"DRT":1349,"PRT":3412,"DOM":3309,"ts":1715839201889,"PLC":1},"mx":{"PLT":6994,"FBT":828,"SCT":57,"DLT":0,"TCP":0,"RAT":771,"FET":6166,"DRT":2795,"DDT":357,"DPT":2438,"PRT":3371,"DOM":3623,"ts":1715839201889,"PLC":1,"VCT":15876},"pr":"0://7/32/33/34/35?36","pl":"Buy OnePlus 12R 5G (8GB, 128GB, Cool Blue) online at best prices from Croma. Check product details, reviews & more. Shop now!","rt":{"v":2,"ic":{"other":2,"link":8,"script":48,"img":26,"xmlhttprequest":13,"fetch":7,"image":1,"video":3,"beacon":2,"css":2,"iframe":4},"it":{"other":1,"link":2,"script":3,"img":4,"xmlhttprequest":5,"fetch":6,"image":7,"video":8,"beacon":9,"css":10,"iframe":11},"rc":{"other":36,"script":48,"css":4,"svg":2,"img":26},"rt":{"other":1,"script":2,"css":3,"svg":4,"img":5},"f":{"1":["startTime","redirectStart","redirectEnd","fetchStart","dnsLookupStart","dnsLookupEnd","connectStart","secureConnectionStart","connectEnd","requestStart","responseStart","responseEnd"],"2":["startTime","fetchStart","responseEnd"]},"t":1715839201889,"r":[{"u":"0://7/8/9/10","i":1,"r":1,"f":1,"o":1,"m":[0,-1,-1,53,53,53,53,-1,53,57,828,1185],"e":-1,"d":-1,"s":-1,"p":""},{"u":"0://37/38/39/40","i":2,"r":1,"f":2,"o":546,"m":[0,0,73],"e":0,"d":0,"s":0,"p":""},{"u":"0://7/38/39/41","i":2,"r":1,"f":2,"o":547,"m":[0,0,73],"e":0,"d":0,"s":0,"p":""},{"u":"0://7/38/39/42","i":2,"r":1,"f":2,"o":547,"m":[0,0,75],"e":0,"d":0,"s":0,"p":""},{"u":"0://7/38/39/43","i":2,"r":1,"f":2,"o":547,"m":[0,0,75],"e":0,"d":0,"s":0,"p":""},{"u":"0://44/45/46","i":3,"r":2,"f":2,"o":585,"m":[0,0,96],"e":0,"d":0,"s":0,"p":""},{"u":"0://47/48/49/50","i":3,"r":2,"f":2,"o":587,"m":[0,0,77],"e":0,"d":0,"s":0,"p":""},{"u":"0://51/52/53/54/55/56/57","i":3,"r":2,"f":2,"o":587,"m":[0,0,257],"e":0,"d":0,"s":0,"p":""},{"u":"0://58/59/22/60?61","i":3,"r":2,"f":2,"o":587,"m":[0,0,392],"e":0,"d":0,"s":0,"p":""},{"u":"0://7/62/63/64","i":2,"r":3,"f":2,"o":587,"m":[0,0,58],"e":0,"d":0,"s":0,"p":""},{"u":"0://7/62/63/65","i":2,"r":3,"f":2,"o":588,"m":[0,0,99],"e":0,"d":0,"s":0,"p":""},{"u":"0://66/67/68/69/70/71/72/73/74/75/76","i":4,"r":4,"f":2,"o":588,"m":[0,0,463],"e":0,"d":0,"s":0,"p":""},{"u":"0://66/67/69/70/77/72/78/79/80/81?82","i":4,"r":5,"f":2,"o":588,"m":[0,0,689],"e":0,"d":0,"s":0,"p":""},{"u":"0://66/67/83//68/69/70/84/72/85/86","i":4,"r":5,"f":2,"o":588,"m":[0,0,675],"e":0,"d":0,"s":0,"p":""},{"u":"0://66/67/69/70/87/72/78/79/80/88?82","i":4,"r":5,"f":2,"o":588,"m":[0,0,681],"e":0,"d":0,"s":0,"p":""},{"u":"0://66/67/69/70/89/72/78/79/80/90?82","i":4,"r":5,"f":2,"o":589,"m":[0,0,682],"e":0,"d":0,"s":0,"p":""},{"u":"0://66/67/69/70/91/72/78/79/80/92?82","i":4,"r":5,"f":2,"o":589,"m":[0,0,684],"e":0,"d":0,"s":0,"p":""},{"u":"0://66/67/69/70/93/72/78/79/80/94?82","i":4,"r":5,"f":2,"o":589,"m":[0,0,684],"e":0,"d":0,"s":0,"p":""},{"u":"0://66/67/69/70/95/72/78/79/80/96?82","i":4,"r":5,"f":2,"o":589,"m":[0,0,686],"e":0,"d":0,"s":0,"p":""},{"u":"0://66/67/69/70/97/72/78/79/80/98?82","i":4,"r":5,"f":2,"o":589,"m":[0,0,687],"e":0,"d":0,"s":0,"p":""},{"u":"0://66/67/69/70/87/72/78/79/80/88?99","i":4,"r":5,"f":2,"o":589,"m":[0,0,690],"e":0,"d":0,"s":0,"p":""},{"u":"0://66/67/69/70/77/72/78/79/80/81?99","i":4,"r":5,"f":2,"o":589,"m":[0,0,696],"e":0,"d":0,"s":0,"p":""},{"u":"0://66/67/69/70/89/72/78/79/80/90?99","i":4,"r":5,"f":2,"o":589,"m":[0,0,697],"e":0,"d":0,"s":0,"p":""},{"u":"0://66/67/69/70/91/72/78/79/80/92?99","i":4,"r":5,"f":2,"o":590,"m":[0,0,702],"e":0,"d":0,"s":0,"p":""},{"u":"0://66/67/69/70/93/72/78/79/80/94?99","i":4,"r":5,"f":2,"o":590,"m":[0,0,702],"e":0,"d":0,"s":0,"p":""},{"u":"0://66/67/69/70/95/72/78/79/80/96?99","i":4,"r":5,"f":2,"o":591,"m":[0,0,703],"e":0,"d":0,"s":0,"p":""},{"u":"0://66/67/69/70/97/72/78/79/80/98?99","i":4,"r":5,"f":2,"o":591,"m":[0,0,715],"e":0,"d":0,"s":0,"p":""},{"u":"0://47/100/101/102","i":3,"r":2,"f":2,"o":726,"m":[0,0,628],"e":0,"d":0,"s":0,"p":""},{"u":"0://47/100/101/103","i":3,"r":2,"f":2,"o":726,"m":[0,0,628],"e":0,"d":0,"s":0,"p":""},{"u":"0://104/105/4/106?107","i":5,"r":1,"f":2,"o":833,"m":[0,0,141],"e":0,"d":0,"s":0,"p":""},{"u":"0://108/109/110","i":3,"r":2,"f":2,"o":857,"m":[0,0,206],"e":0,"d":0,"s":0,"p":""},{"u":"0://111/112/113","i":2,"r":1,"f":2,"o":955,"m":[0,0,12],"e":0,"d":0,"s":0,"p":""},{"u":"0://21/26/114/45","i":6,"r":1,"f":2,"o":1333,"m":[0,0,104],"e":0,"d":0,"s":0,"p":""},{"u":"0://7/38/115/116","i":7,"r":4,"f":2,"o":1508,"m":[0,0,34],"e":0,"d":0,"s":0,"p":""},{"u":"0://66/67/68/117/70/118/72/119/120/121?122","i":8,"r":1,"f":2,"o":1661,"m":[0,0,3977],"e":0,"d":0,"s":0,"p":""},{"u":"0://123/124?125","i":3,"r":2,"f":2,"o":1663,"m":[0,0,56],"e":0,"d":0,"s":0,"p":""},{"u":"0://126/127/128","i":3,"r":2,"f":2,"o":1664,"m":[0,0,42],"e":0,"d":0,"s":0,"p":""},{"u":"0://7/38/60/129","i":3,"r":2,"f":2,"o":1664,"m":[0,0,34],"e":0,"d":0,"s":0,"p":""},{"u":"0://7/38/60/130","i":3,"r":2,"f":2,"o":1665,"m":[0,0,33],"e":0,"d":0,"s":0,"p":""},{"u":"0://7/62/60/131","i":3,"r":2,"f":2,"o":1667,"m":[0,0,75],"e":0,"d":0,"s":0,"p":""},{"u":"0://7/62/60/132","i":3,"r":2,"f":2,"o":1679,"m":[0,0,313],"e":0,"d":0,"s":0,"p":""},{"u":"0://108/109/133/134/4/135","i":5,"r":1,"f":2,"o":1733,"m":[0,0,26],"e":0,"d":0,"s":0,"p":""},{"u":"0://123/136/60?137","i":3,"r":2,"f":2,"o":2130,"m":[0,0,4],"e":0,"d":0,"s":0,"p":""},{"u":"0://123/136/138?139","i":3,"r":2,"f":2,"o":2141,"m":[0,0,4],"e":0,"d":0,"s":0,"p":""},{"u":"0://140/141","i":3,"r":2,"f":2,"o":2147,"m":[0,0,13],"e":0,"d":0,"s":0,"p":""},{"u":"0://142/60/143/144?145","i":3,"r":2,"f":2,"o":2148,"m":[0,0,14],"e":0,"d":0,"s":0,"p":""},{"u":"0://146/34/147?148","i":3,"r":2,"f":2,"o":2149,"m":[0,0,92],"e":0,"d":0,"s":0,"p":""},{"u":"0://123/136/138?149","i":3,"r":2,"f":2,"o":2150,"m":[0,0,39],"e":0,"d":0,"s":0,"p":""},{"u":"0://123/136/138?150","i":3,"r":2,"f":2,"o":2151,"m":[0,0,73],"e":0,"d":0,"s":0,"p":""},{"u":"0://123/136/138?151","i":3,"r":2,"f":2,"o":2153,"m":[0,0,72],"e":0,"d":0,"s":0,"p":""},{"u":"0://152/153/154","i":3,"r":2,"f":2,"o":2166,"m":[0,0,62],"e":0,"d":0,"s":0,"p":""},{"u":"0://27/62/155","i":3,"r":2,"f":2,"o":2166,"m":[0,0,48],"e":0,"d":0,"s":0,"p":""},{"u":"0://156/60/157","i":3,"r":2,"f":2,"o":2168,"m":[0,0,59],"e":0,"d":0,"s":0,"p":""},{"u":"0://21/22/45/158/159","i":6,"r":1,"f":2,"o":2179,"m":[0,0,181],"e":0,"d":0,"s":0,"p":""},{"u":"0://7/62/60/160","i":3,"r":2,"f":2,"o":2737,"m":[0,0,90],"e":0,"d":0,"s":0,"p":""},{"u":"0://7/62/60/161","i":3,"r":2,"f":2,"o":2738,"m":[0,0,129],"e":0,"d":0,"s":0,"p":""},{"u":"0://7/62/60/162","i":3,"r":2,"f":2,"o":2738,"m":[0,0,112],"e":0,"d":0,"s":0,"p":""},{"u":"0://7/62/60/163","i":3,"r":2,"f":2,"o":2739,"m":[0,0,117],"e":0,"d":0,"s":0,"p":""},{"u":"0://7/62/60/164","i":3,"r":2,"f":2,"o":2740,"m":[0,0,119],"e":0,"d":0,"s":0,"p":""},{"u":"0://21/22/23/24/165","i":5,"r":1,"f":2,"o":2977,"m":[0,0,285],"e":0,"d":0,"s":0,"p":""},{"u":"0://21/166/167","i":5,"r":1,"f":2,"o":2978,"m":[0,0,297],"e":0,"d":0,"s":0,"p":""},{"u":"0://66/67/68/69/70/77/72/78/79/80/81","i":4,"r":5,"f":2,"o":2978,"m":[0,0,328],"e":0,"d":0,"s":0,"p":""},{"u":"0://1/168/169/45/170/171/","i":5,"r":1,"f":2,"o":2981,"m":[0,0,265],"e":0,"d":0,"s":0,"p":""},{"u":"0://1/172/4/173?174","i":5,"r":1,"f":2,"o":2982,"m":[0,0,254],"e":0,"d":0,"s":0,"p":""},{"u":"0://1/175/4/176?177","i":5,"r":1,"f":2,"o":2982,"m":[0,0,256],"e":0,"d":0,"s":0,"p":""},{"u":"0://7/38/60/178","i":3,"r":2,"f":2,"o":2984,"m":[0,0,269],"e":0,"d":0,"s":0,"p":""},{"u":"0://7/62/63/179","i":2,"r":3,"f":2,"o":3196,"m":[0,0,106],"e":0,"d":0,"s":0,"p":""},{"u":"0://7/62/60/180","i":3,"r":2,"f":2,"o":3197,"m":[0,0,111],"e":0,"d":0,"s":0,"p":""},{"u":"0://58/59/22/181/182?183","i":5,"r":1,"f":2,"o":3271,"m":[0,0,459],"e":0,"d":0,"s":0,"p":""},{"u":"0://58/184/22/60/185/186/187","i":3,"r":2,"f":2,"o":3282,"m":[0,0,53],"e":0,"d":0,"s":0,"p":""},{"u":"0://58/184/22/60/185/186/188","i":3,"r":2,"f":2,"o":3282,"m":[0,0,50],"e":0,"d":0,"s":0,"p":""},{"u":"0://58/184/22/60/185/186/189","i":3,"r":2,"f":2,"o":3283,"m":[0,0,41],"e":0,"d":0,"s":0,"p":""},{"u":"0://152/190/114/191?192","i":3,"r":2,"f":2,"o":3422,"m":[0,0,4],"e":0,"d":0,"s":0,"p":""},{"u":"0://21/22/23/24/25","i":6,"r":1,"f":2,"o":3554,"m":[0,0,152],"e":0,"d":0,"s":0,"p":""},{"u":"0://1/2/3/4/5?6","i":5,"r":1,"f":2,"o":3576,"m":[0,0,100],"e":0,"d":0,"s":0,"p":""},{"u":"0://21/26/25/4","i":6,"r":1,"f":2,"o":3580,"m":[0,0,86],"e":0,"d":0,"s":0,"p":""},{"u":"0://193/194/195/196/?197","i":3,"r":2,"f":2,"o":3997,"m":[0,0,364],"e":0,"d":0,"s":0,"p":""},{"u":"0://193/194/195/196/?198","i":3,"r":2,"f":2,"o":4069,"m":[0,0,280],"e":0,"d":0,"s":0,"p":""},{"u":"0://199/200","i":3,"r":2,"f":2,"o":4086,"m":[0,0,21],"e":0,"d":0,"s":0,"p":""},{"u":"0://21/26/25/4","i":6,"r":1,"f":2,"o":4174,"m":[0,0,190],"e":0,"d":0,"s":0,"p":""},{"u":"0://201/202/203?204","i":9,"r":1,"f":2,"o":4302,"m":[0,0,84],"e":0,"d":0,"s":0,"p":""},{"u":"0://201/202/203?204","i":9,"r":1,"f":2,"o":4303,"m":[0,0,83],"e":0,"d":0,"s":0,"p":""},{"u":"0://193/194/195/196/?205","i":3,"r":2,"f":2,"o":4315,"m":[0,0,92],"e":0,"d":0,"s":0,"p":""},{"u":"0://7/38/39/206","i":10,"r":3,"f":2,"o":4352,"m":[0,0,18],"e":0,"d":0,"s":0,"p":""},{"u":"0://207/208?","i":11,"r":1,"f":2,"o":4496,"m":[0,0,1704],"e":0,"d":0,"s":0,"p":""},{"u":"0://209/210?","i":11,"r":1,"f":2,"o":4696,"m":[0,0,1499],"e":0,"d":0,"s":0,"p":""},{"u":"0://209/210?","i":11,"r":1,"f":2,"o":4722,"m":[0,0,1576],"e":0,"d":0,"s":0,"p":""},{"u":"0://211/212?213","i":3,"r":2,"f":2,"o":4870,"m":[0,0,241],"e":0,"d":0,"s":0,"p":""},{"u":"0://193/194/195/214/?215","i":3,"r":2,"f":2,"o":5176,"m":[0,0,93],"e":0,"d":0,"s":0,"p":""},{"u":"0://193/194/195/214/?216","i":3,"r":2,"f":2,"o":5204,"m":[0,0,94],"e":0,"d":0,"s":0,"p":""},{"u":"0://66/67/68/117/70/118/72/119/120/121?122","i":8,"r":1,"f":2,"o":5237,"m":[0,0,346],"e":0,"d":0,"s":0,"p":""},{"u":"0://11/12/13/14/15/16/17","i":5,"r":1,"f":2,"o":5318,"m":[0,0,47],"e":0,"d":0,"s":0,"p":""},{"u":"0://27/28?217","i":5,"r":1,"f":2,"o":5422,"m":[0,0,527],"e":0,"d":0,"s":0,"p":""},{"u":"0://218/219?220","i":3,"r":2,"f":2,"o":5450,"m":[0,0,229],"e":0,"d":0,"s":0,"p":""},{"u":"0://218/219?221","i":3,"r":2,"f":2,"o":5469,"m":[0,0,462],"e":0,"d":0,"s":0,"p":""},{"u":"0://218/219?222","i":3,"r":2,"f":2,"o":5482,"m":[0,0,246],"e":0,"d":0,"s":0,"p":""},{"u":"0://140/9/223/224","i":3,"r":2,"f":2,"o":5560,"m":[0,0,5],"e":0,"d":0,"s":0,"p":""},{"u":"0://140/223/225?226","i":4,"r":5,"f":2,"o":5603,"m":[0,0,137],"e":0,"d":0,"s":0,"p":""},{"u":"0://227/228?229#230","i":11,"r":1,"f":2,"o":5605,"m":[0,0,525],"e":0,"d":0,"s":0,"p":""},{"u":"0://1/18/3/4/19?231","i":5,"r":1,"f":2,"o":5734,"m":[0,0,95],"e":0,"d":0,"s":0,"p":""},{"u":"0://232/28/?233","i":4,"r":5,"f":2,"o":5886,"m":[0,0,113],"e":0,"d":0,"s":0,"p":""},{"u":"0://232/28/?233","i":4,"r":5,"f":2,"o":5886,"m":[0,0,111],"e":0,"d":0,"s":0,"p":""},{"u":"0://232/28/?234","i":4,"r":5,"f":2,"o":5886,"m":[0,0,108],"e":0,"d":0,"s":0,"p":""},{"u":"0://235/194/236/196/?237","i":4,"r":5,"f":2,"o":5903,"m":[0,0,675],"e":0,"d":0,"s":0,"p":""},{"u":"0://235/194/236/196/?238","i":4,"r":5,"f":2,"o":5905,"m":[0,0,665],"e":0,"d":0,"s":0,"p":""},{"u":"0://235/194/236/196/?239","i":4,"r":5,"f":2,"o":5907,"m":[0,0,671],"e":0,"d":0,"s":0,"p":""},{"u":"0://235/194/236/214/?240","i":4,"r":5,"f":2,"o":6071,"m":[0,0,487],"e":0,"d":0,"s":0,"p":""},{"u":"0://235/194/236/214/?241","i":4,"r":5,"f":2,"o":6089,"m":[0,0,489],"e":0,"d":0,"s":0,"p":""},{"u":"0://66/242/83//68/69/70/243/244","i":10,"r":5,"f":2,"o":6129,"m":[0,0,8],"e":0,"d":0,"s":0,"p":""},{"u":"0://66/67/68/117/70/118/72/119/120/121?122","i":8,"r":1,"f":2,"o":6155,"m":[0,0,999],"e":0,"d":0,"s":0,"p":""},{"u":"0://30/31/19","i":5,"r":1,"f":2,"o":6297,"m":[0,0,325],"e":0,"d":0,"s":0,"p":""},{"u":"0://21/26/25/4","i":6,"r":1,"f":2,"o":6586,"m":[0,0,79],"e":0,"d":0,"s":0,"p":""},{"u":"0://21/26/25/4","i":6,"r":1,"f":2,"o":6589,"m":[0,0,126],"e":0,"d":0,"s":0,"p":""},{"u":"0://126/245","i":3,"r":2,"f":2,"o":6722,"m":[0,0,6],"e":0,"d":0,"s":0,"p":""},{"u":"0://7/38/246","i":1,"r":1,"f":2,"o":6777,"m":[0,0,5],"e":0,"d":0,"s":0,"p":""},{"u":"0://7/38/60/247","i":3,"r":2,"f":2,"o":7669,"m":[0,0,4],"e":0,"d":0,"s":0,"p":""}]},"bd":0,"si":45}],"ai":"477d42aa_9f21_9144_1a76_688c9aa25e4b","gs":["06a6dd02_3c5f_2943_3169_f771971f39e1","7b29cf6f_0eda_18d9_4613_17eb759c792b","40adddb6_5539_8ea5_1ed9_f2f480540f32","49bf63bc_de2f_2d31_3126_8a19994db37b","9cb3b7a4_cd62_e28c_02a9_ec5c8cd62d6f","4475fd08_b9f0_4959_ebda_53d274701970","5dd5fc63_cd05_5c22_f008_739b16098bba","7d7958fc_5b67_f27a_210d_677f98004d9f","c9c70d19_4294_48a6_949c_c6e93a007ace","8b7d1922_809e_c3e0_7b2b_74a4c8fd0158","823d6a45_4300_26b4_ae13_3c5dca0485a2"],"up":["https","api.croma.com","product","allchannels","v1","emidata","fields=FULL&amount=39999","www.croma.com","oneplus-12r-5g-8gb-128gb-cool-blue-","p","304697","smetrics.croma.com","b","ss","infinitipwa","1","JS-2.25.0-LDQM","s47313657844741","cmstemplate","page","pageType=ContentPage&pageLabelOrId=pwaHomePageFooter&fields=FULL","api.tatadigital.com","api","v1.1","msd","events","analytics-engine","capi.croma.com","tr","id=1369867960112522&ev=ViewContent&et=1715839207&es=https%3A%2F%2Fwww.croma.com%2Foneplus-12r-5g-8gb-128gb-cool-blue-%2Fp%2F304697&referrer=https%3A%2F%2Fwww.croma.com%2Fcampaign%2Foneplus-r-5g%2Fc%2F6407%3Fq%3D%253Aprice-asc&eid=53824125171208&ua=Mozilla%2F5.0%20(X11%3B%20Linux%20x86_64)%20AppleWebKit%2F537.36%20(KHTML%2C%20like%20Gecko)%20Chrome%2F114.0.0.0%20Safari%2F537.36&fbp=fb.1.1715839140634.281453602&external_id=dd225ea0e0a549dff2458f2b188bd0b54a923171c4b30d006a0ce3ff08...","rs.fullstory.com","rec","campaign","oneplus-r-5g","c","6407","q=%3Aprice-asc","assets.croma.com","assets","fonts","croma.woff2","Switzer-Bold.woff2","Switzer-Regular.woff2","Switzer-Medium.woff2","accounts.tatadigital.com","v2","tdl-sso-auth.js","assets.adobedtm.com","a83cfb422665","6969f0a69b1e","launch-883ee2cb26fd.min.js","cdnjs.cloudflare.com","ajax","libs","crypto-js","3.1.2","rollups","aes.js","maps.googleapis.com","maps","js","key=AIzaSyBALhlQSaWB7dWn--IJ95ozhB3_3Zzlcdc&libraries=places...","static","css","19.7113b688.chunk.css","main.50a49cb7.chunk.css","media-ik.croma.com","...","media.croma.com","image","upload","v1637759004","Croma%20Assets","CMS","Category%20icon","Final%20icon","Croma_Logo_acrkvn.svg","v1706791128","Communication","Mobiles","Images","304697_zp8rwp.png","tr=w-100","https:","f_auto,q_auto,d_Croma%20Assets:No_image.png","UI%20Assets","video_thumbnail.png","v1707378062","304697_1_vkmmz6.png","v1707378061","304697_2_lheiul.png","v1706791125","304697_3_htrwa0.png","v1706791120","304697_4_uaovpj.png","v1706791110","304697_5_xlaa6u.png","v1706791113","304697_6_vb8mx6.png","tr=w-640","extensions","EPef068a8d6dd34a43866d9a80cc98baab","AppMeasurement.min.js","AppMeasurement_Module_ActivityMap.min.js","cromaretail.tt.omtrdc.net","rest","delivery","client=cromaretail&sessionId=895fcaa2d50341f0b4231873c20498c...","edge.fullstory.com","s","fs.js","s.go-mpulse.net","boomerang","Y64HZ-S7F3X-X4LT4-6FRFB-MK4UE","config","images","cts-white.svg","video","v1713436641","Videos","2024%20Videos","304697_w9hxoc.mp4","tr=q-70","www.googletagmanager.com","gtm.js","id=GTM-5X2VQJX","cdn.appdynamics.com","adrum","adrum-23.10.1.4359.js","cromaUtility.min.js","cromaSso.min.js","19.b5f9868a.chunk.js","main.705c574a.chunk.js","settings","11EGJ5","web","gtag","id=G-DJ3RGVFHJN&l=dataLayer&cx=c","destination","id=AW-609902077&l=dataLayer&cx=c","bat.bing.com","bat.js","dynamic.criteo.com","ld","ld.js","a=56256","static.hotjar.com","hotjar-3400595.js","sv=7","id=AW-1006316414&l=dataLayer&cx=c","id=DC-917807264&l=dataLayer&cx=c","id=DC-13135721&l=dataLayer&cx=c","connect.facebook.net","en_US%20","fbevents.js","DhPixel.js","d2r1yp2w7bby2u.cloudfront.net","clevertap.min.js","sso","check-session","52.3a9a1fa1.chunk.js","59.7c9407cc.chunk.js","51.9d947cc8.chunk.js","60.71510179.chunk.js","62.71e43375.chunk.js","data","getApplicablePromotion","getApplicationPromotionsForItemOffer","inventory","oms","tms","details-pwa","sku","essentialcombo","pinCode=400049&ProductSkus=304697","pricing-services","price","productList=304697","Drift.min.js","40.5effb02f.chunk.css","40.93cbd39b.chunk.js","mapsjs","gen_204","csp_test=true","maps-api-v3","56","12a","common.js","util.js","geocoder.js","signals","1369867960112522","v=2.9.156&r=stable&domain=www.croma.com&hme=c3a545c63044e8e9...","www.googleadservices.com","pagead","conversion","1006316414","random=1715839206129&cv=11&fst=1715839206129&bg=ffffff&guid=...","random=1715839206187&cv=11&fst=1715839206187&bg=ffffff&guid=...","script.hotjar.com","modules.e5979922753cf3b8b069.js","analytics.google.com","g","collect","v=2&tid=G-DJ3RGVFHJN&gtm=45je45f0v893318240z8889407033za200&...","random=1715839206494&cv=11&fst=1715839206494&bg=ffffff&guid=...","Switzer-Light.woff2","917807264.fls.doubleclick.net","activityi;src=917807264;type=i...b-128gb-cool-blue-%2Fp%2F304697","13135721.fls.doubleclick.net","activityi;src=13135721;type=cr...b-128gb-cool-blue-%2Fp%2F304697","sslwidget.criteo.com","event","a=56256&v=5.23.0&otl=1&p0=e%3Dexd%26site_type%3Dd&p1=e%3Dvp%...","609902077","random=1715839207284&cv=11&fst=1715839207284&bg=ffffff&guid=...","random=1715839207382&cv=11&fst=1715839207382&bg=ffffff&guid=...","id=1369867960112522&ev=ViewContent&et=1715839207&es=https%3A...","in1.clevertap-prod.com","a","t=96&type=push&d=N4IgLgngDgpiBcIoCcD2AzAlgGzgGiTS1wVAGMwB9VK...","t=96&type=push&d=N4IgLgngDgpiBcIYDcYDswgDROWAcgIYC2ciAxgM4D6...","t=96&type=page&d=N4IglgJiBcIGwHYCcBaOAlA0ipC4C0QAaEAcxngDMAG...","action","25149556.js","0","ti=25149556&tm=gtm002&Ver=2&mid=fb6c219e-30e1-49ce-9d0d-675f...","gumi.criteo.com","syncframe","topUrl=www.croma.com&origin=onetag","{%22bundle%22:{%22origin%22:3,%22value%22:%22EPlPXl9ZQjN2TTd...","pageType=ContentPage&pageLabelOrId=pwaHomePageFooter&fields=...","www.facebook.com","id=1369867960112522&ev=PageView&dl=https%3A%2F%2Fwww.croma.c...","id=1369867960112522&ev=ViewContent&dl=https%3A%2F%2Fwww.crom...","googleads.g.doubleclick.net","viewthroughconversion","random=36128514&cv=11&fst=1715839206129&bg=ffffff&guid=ON&as...","random=1995214093&cv=11&fst=1715839206187&bg=ffffff&guid=ON&...","random=1114128768&cv=11&fst=1715839206494&bg=ffffff&guid=ON&...","random=1085583075&cv=11&fst=1715839207284&bg=ffffff&guid=ON&...","random=730121051&cv=11&fst=1715839207382&bg=ffffff&guid=ON&a...","prod","v1639657222","insta_before_v2nnfx.png","adrum-ext.a57fe9a4dfa0e1d6b2dc001466e4e21d.js","favicon.ico","shopWithVideo.min.js"]}
--Response 
HTTP/1.1 200
date: Thu, 16 May 2024 06:00:13 GMT
content-type: text/html
set-cookie: ADRUM_BTa=R:22|g:57df950f-b4bc-4814-a9ae-e0ffc1ed4322; Path=/; Expires=Thu, 16-May-2024 06:00:43 GMT; Max-Age=30
set-cookie: ADRUM_BTa=R:22|g:57df950f-b4bc-4814-a9ae-e0ffc1ed4322|n:appdynamics_46b45e6c-9ffd-4db5-9fe0-e4760639f012; Path=/; Expires=Thu, 16-May-2024 06:00:43 GMT; Max-Age=30
set-cookie: SameSite=None; Path=/; Expires=Thu, 16-May-2024 06:00:43 GMT; Max-Age=30; Secure
set-cookie: ADRUM_BT1=R:22|i:57892; Path=/; Expires=Thu, 16-May-2024 06:00:43 GMT; Max-Age=30
set-cookie: ADRUM_BT1=R:22|i:57892|e:4; Path=/; Expires=Thu, 16-May-2024 06:00:43 GMT; Max-Age=30
set-cookie: ADRUM_BT1=R:22|i:57892|e:4|t:1715839213635; Path=/; Expires=Thu, 16-May-2024 06:00:43 GMT; Max-Age=30
expires: 0
cache-control: private, no-cache, no-store, must-revalidate, max-age=0, proxy-revalidate, s-maxage=0
pragma: no-cache
vary: *
x-content-type-options: nosniff
strict-transport-security: max-age=31536010; includeSubDomains
access-control-allow-origin: *
access-control-allow-headers: origin, content-type, accept
x-envoy-upstream-service-time: 0
server: envoy
----

