--Request 
POST https://analytics.google.com/g/collect?v=2&tid=G-DJ3RGVFHJN&gtm=45je45f0v893318240z8889407033za200&_p=1715839203848&gcd=13l3l3l3l1&npa=0&dma=0&cid=1944455297.1715839141&ul=en-us&sr=1523x650&uaa=x86&uab=64&uafvl=Not.A%252FBrand%3B8.0.0.0%7CChromium%3B114.0.5735.199&uamb=0&uam=&uap=Linux&uapv=5.15.0&uaw=0&frm=0&pscdl=noapi&_eu=IA&_s=5&sid=1715839140&sct=1&seg=1&dl=https%3A%2F%2Fwww.croma.com%2Foneplus-12r-5g-8gb-128gb-cool-blue-%2Fp%2F304697&dr=https%3A%2F%2Fwww.croma.com%2Fcampaign%2Foneplus-r-5g%2Fc%2F6407%3Fq%3D%253Aprice-asc&dt=Buy%20OnePlus%2012R%205G%20(8GB%2C%20128GB%2C%20Cool%20Blue)%20online%20at%20best%20prices%20from%20Croma.%20Check%20product%20details%2C%20reviews%20%26%20more.%20Shop%20now!&uid=false&en=add_to_cart&_c=1&pr1=id304697~nmOnePlus%2012R%205G%20(8GB%2C%20128GB%2C%20Cool%20Blue)~afcroma.com~cpN%2FA~k0currency~v0N%2FA~ds0%25~lpN%2FA~brOnePlus~caPhones%20%26%20Wearables~c2Mobile%20Phones~c3Android%20Phones~c4N%2FA~c5N%2FA~liN%2FA~lnN%2FA~vaN%2FA~loN%2FA~pr39999~qt1~k1price_mrp~v139999&ep.pagetype=pdp&ep.source_page_url=%2Foneplus-12r-5g-8gb-128gb-cool-blue-%2Fp%2F304697&ep.previous_page_url=%2Fcampaign%2Foneplus-r-5g%2Fc%2F6407&ep.login_trigger=N%2FA&ep.login_status=false&ep.click_text=Add%20to%20Cart&ep.is_cross_sell=N%2FA&_et=47229&tfd=171028
Host: analytics.google.com
sec-ch-ua: \"Not.A/Brand\";v=\"8\", \"Chromium\";v=\"114\"
sec-ch-ua-mobile: ?0
User-Agent: Mozilla/5.0 (X11; Linux x86_64) AppleWebKit/537.36 (KHTML, like Gecko) Chrome/114.0.0.0 Safari/537.36
sec-ch-ua-platform: \"Linux\"
Accept: */*
Sec-Fetch-Site: cross-site
Sec-Fetch-Mode: no-cors
Sec-Fetch-Dest: empty
Referer: https://www.croma.com/
Accept-Encoding: gzip, deflate, br
Accept-Language: en-US,en;q=0.9
----
 POSTDATA 
--Response 
HTTP/1.1 204
access-control-allow-origin: *
date: Thu, 16 May 2024 06:02:53 GMT
pragma: no-cache
expires: Fri, 01 Jan 1990 00:00:00 GMT
cache-control: no-cache, no-store, must-revalidate
content-type: text/plain
cross-origin-resource-policy: cross-origin
server: Golfe2
content-length: 0
alt-svc: h3=\":443\"; ma=2592000,h3-29=\":443\"; ma=2592000
----
--Request 
GET https://www.googleadservices.com/pagead/conversion/1006316414/?random=1715839373216&cv=11&fst=1715839373216&bg=ffffff&guid=ON&async=1&gtm=45be45f0v888728434z8889407033za201&gcd=13l3l3l3l1&dma=0&u_w=1523&u_h=650&url=https%3A%2F%2Fwww.croma.com%2Foneplus-12r-5g-8gb-128gb-cool-blue-%2Fp%2F304697&ref=https%3A%2F%2Fwww.croma.com%2Fcampaign%2Foneplus-r-5g%2Fc%2F6407%3Fq%3D%253Aprice-asc&label=aZMGCJi0kJYYEP7W7N8D&hn=www.googleadservices.com&frm=0&tiba=Buy%20OnePlus%2012R%205G%20(8GB%2C%20128GB%2C%20Cool%20Blue)%20online%20at%20best%20prices%20from%20Croma.%20Check%20product%20details%2C%20reviews%20%26%20more.%20Shop%20now!&value=0&bttype=purchase&npa=0&ec_m=%23specification_container%3E%3Anth-child(23)%3E%3Anth-child(2)%3E%3Anth-child(2)%3E%3Anth-child(1)%3E%3Anth-child(2)*LI%3Atrue%3A23%3Afalse*1&ec_sel=%23specification_container%3E%3Anth-child(23)%3E%3Anth-child(2)%3E%3Anth-child(2)%3E%3Anth-child(1)%3E%3Anth-child(2)&ec_meta=LI%3Atrue%3A23%3Afalse&ec_lat=5&ec_s=1&pscdl=noapi&auid=1421799651.1715839140&uaa=x86&uab=64&uafvl=Not.A%252FBrand%3B8.0.0.0%7CChromium%3B114.0.5735.199&uamb=0&uam=&uap=Linux&uapv=5.15.0&uaw=0&fdr=QA&rfmt=3&fmt=4
Host: www.googleadservices.com
sec-ch-ua: \"Not.A/Brand\";v=\"8\", \"Chromium\";v=\"114\"
sec-ch-ua-mobile: ?0
User-Agent: Mozilla/5.0 (X11; Linux x86_64) AppleWebKit/537.36 (KHTML, like Gecko) Chrome/114.0.0.0 Safari/537.36
sec-ch-ua-platform: \"Linux\"
Accept: */*
Sec-Fetch-Site: cross-site
Sec-Fetch-Mode: no-cors
Sec-Fetch-Dest: script
Referer: https://www.croma.com/
Accept-Encoding: gzip, deflate, br
Accept-Language: en-US,en;q=0.9
----
--Response 
HTTP/1.1 200
p3p: policyref=\"https://www.googleadservices.com/pagead/p3p.xml\", CP=\"NOI DEV PSA PSD IVA IVD OTP OUR OTR IND OTC\"
timing-allow-origin: *
cross-origin-resource-policy: cross-origin
date: Thu, 16 May 2024 06:02:53 GMT
pragma: no-cache
expires: Fri, 01 Jan 1990 00:00:00 GMT
cache-control: no-cache, must-revalidate
content-type: text/javascript; charset=UTF-8
x-content-type-options: nosniff
content-disposition: attachment; filename=\"f.txt\"
content-encoding: br
server: cafe
content-length: 1824
x-xss-protection: 0
alt-svc: h3=\":443\"; ma=2592000,h3-29=\":443\"; ma=2592000
----
--Request 
GET https://13135721.fls.doubleclick.net/activityi;src=13135721;type=croma04;cat=croma0;ord=1832841054768;u=%2Foneplus-12r-5g-8gb-128gb-cool-blue-%2Fp%2F304697;npa=0;auiddc=1421799651.1715839140;uaa=x86;uab=64;uafvl=Not.A%252FBrand%3B8.0.0.0%7CChromium%3B114.0.5735.199;uamb=0;uam=;uap=Linux;uapv=5.15.0;uaw=0;pscdl=noapi;frm=0;gtm=45fe45f0z8889407033za201;gcd=13l3l3l3l1;dma=0;epver=2;~oref=https%3A%2F%2Fwww.croma.com%2Foneplus-12r-5g-8gb-128gb-cool-blue-%2Fp%2F304697?
Host: 13135721.fls.doubleclick.net
sec-ch-ua: \"Not.A/Brand\";v=\"8\", \"Chromium\";v=\"114\"
sec-ch-ua-mobile: ?0
sec-ch-ua-platform: \"Linux\"
Upgrade-Insecure-Requests: 1
User-Agent: Mozilla/5.0 (X11; Linux x86_64) AppleWebKit/537.36 (KHTML, like Gecko) Chrome/114.0.0.0 Safari/537.36
Accept: text/html,application/xhtml+xml,application/xml;q=0.9,image/avif,image/webp,image/apng,*/*;q=0.8,application/signed-exchange;v=b3;q=0.7
Sec-Fetch-Site: cross-site
Sec-Fetch-Mode: navigate
Sec-Fetch-User: ?1
Sec-Fetch-Dest: iframe
Referer: https://www.croma.com/
Accept-Encoding: gzip, deflate, br
Accept-Language: en-US,en;q=0.9
----
--Response 
HTTP/1.1 302
p3p: policyref=\"https://googleads.g.doubleclick.net/pagead/gcn_p3p_.xml\", CP=\"CURa ADMa DEVa TAIo PSAo PSDo OUR IND UNI PUR INT DEM STA PRE COM NAV OTC NOI DSP COR\"
timing-allow-origin: *
cross-origin-resource-policy: cross-origin
date: Thu, 16 May 2024 06:02:53 GMT
pragma: no-cache
expires: Fri, 01 Jan 1990 00:00:00 GMT
cache-control: no-cache, must-revalidate
follow-only-when-prerender-shown: 1
strict-transport-security: max-age=21600
location: https://13135721.fls.doubleclick.net/activityi;dc_pre=COqb5OK_kYYDFcXyTAIdHEUMUA;src=13135721;type=croma04;cat=croma0;ord=1832841054768;u=%2Foneplus-12r-5g-8gb-128gb-cool-blue-%2Fp%2F304697;npa=0;auiddc=1421799651.1715839140;uaa=x86;uab=64;uafvl=Not.A%252FBrand%3B8.0.0.0%7CChromium%3B114.0.5735.199;uamb=0;uam=;uap=Linux;uapv=5.15.0;uaw=0;pscdl=noapi;frm=0;gtm=45fe45f0z8889407033za201;gcd=13l3l3l3l1;dma=0;epver=2;~oref=https%3A%2F%2Fwww.croma.com%2Foneplus-12r-5g-8gb-128gb-cool-blue-%2Fp%2F304697?
content-type: text/html; charset=UTF-8
x-content-type-options: nosniff
server: cafe
content-length: 0
x-xss-protection: 0
alt-svc: h3=\":443\"; ma=2592000,h3-29=\":443\"; ma=2592000
----
--Request 
GET https://media.croma.com/image/upload/f_auto,q_auto,d_Croma%20Assets:No_image.png/Croma%20Assets/UI%20Assets/lazyLoading.gif
Host: media.croma.com
sec-ch-ua: \"Not.A/Brand\";v=\"8\", \"Chromium\";v=\"114\"
sec-ch-ua-mobile: ?0
User-Agent: Mozilla/5.0 (X11; Linux x86_64) AppleWebKit/537.36 (KHTML, like Gecko) Chrome/114.0.0.0 Safari/537.36
sec-ch-ua-platform: \"Linux\"
Accept: image/avif,image/webp,image/apng,image/svg+xml,image/*,*/*;q=0.8
Sec-Fetch-Site: same-site
Sec-Fetch-Mode: no-cors
Sec-Fetch-Dest: image
Referer: https://www.croma.com/
Accept-Encoding: gzip, deflate, br
Accept-Language: en-US,en;q=0.9
Cookie: AKA_A2=A; at_check=true; AMCVS_E78F53F05EFEF21E0A495E58%40AdobeOrg=1; s_ecid=MCMID%7C23208888194201725061814923007976880958; s_plt=NaN; s_pltp=undefined; s_cc=true; _gcl_au=1.1.1421799651.1715839140; AMCV_E78F53F05EFEF21E0A495E58%40AdobeOrg=179643557%7CMCIDTS%7C19860%7CMCMID%7C23208888194201725061814923007976880958%7CMCAAMLH-1716443939%7C12%7CMCAAMB-1716443939%7C6G1ynYcLPuiQxYZrsz_pkqfLG9yMXBpb2zX5dvJdYQJzPXImdj0y%7CMCOPTOUT-1715846339s%7CNONE%7CMCAID%7CNONE%7CMCSYNCSOP%7C411-19867%7CvVersion%7C5.5.0; _hjSession_3400595=eyJpZCI6ImFiMTJiMDJjLTFjMWYtNDJkOC1iOGYxLTAwY2Q2ZDYyMWM1ZSIsImMiOjE3MTU4MzkxNDA2MDksInMiOjAsInIiOjAsInNiIjowLCJzciI6MCwic2UiOjAsImZzIjoxLCJzcCI6MH0=; _fbp=fb.1.1715839140634.281453602; _ga=GA1.1.1944455297.1715839141; WZRK_G=6f08a8df4ce04ff4b786855393b6d325; mbox=session#895fcaa2d50341f0b4231873c20498c7#1715841064|PC#895fcaa2d50341f0b4231873c20498c7.41_0#1779084004; s_ips=523; th_external_id=dd225ea0e0a549dff2458f2b188bd0b54a923171c4b30d006a0ce3ff08d8fa8c; _uetsid=6467a920134911efa7d615e2de33fb03; _uetvid=6467fc40134911efa1829f1407dcc88b; _hjSessionUser_3400595=eyJpZCI6Ijk2YjE5NmY3LWRkMzMtNTkxYy1iY2IyLTIzMDNlMDRkNzEyNSIsImNyZWF0ZWQiOjE3MTU4MzkxNDA2MDUsImV4aXN0aW5nIjp0cnVlfQ==; cto_bundle=WwpUr19ZQjN2TTdzaTNPd0Q0dlByN3VaMFZMOEIwMTVJWjE0ZXI3bEFGMGJFZUxUZ2pPQ2F0Vk5FdlY1cXpBTXJ6bWF1WlppM040TnV2MU1IMnJNbjFlMTQ1UllVN2hSbHpzJTJGT1J0eFNnZ1FnekxaakRmcGh3THpVMnd2VnJVMzMlMkJFU2U; s_tp=6437; s_ppv=pdp%2C44%2C8%2C2860%2C5%2C12; WZRK_S_679-6RK-976Z=%7B%22p%22%3A2%2C%22s%22%3A1715839141%2C%22t%22%3A1715839327%7D; s_nr30=1715839373133-New; s_sq=%5B%5BB%5D%5D; _ga_DJ3RGVFHJN=GS1.1.1715839140.1.1.1715839373.12.0.0
----
--Response 
HTTP/1.1 200
content-type: image/avif
etag: \"14b9259887b5bae54fadc101c30b91f4\"
last-modified: Tue, 24 Jan 2023 12:55:25 GMT
date: Thu, 16 May 2024 05:59:25 GMT
vary: Save-Data
cache-control: private, no-transform, max-age=31536000
server-timing: cld-fastly;dur=1;start=2024-05-16T05:59:25.295Z;desc=hit,rtt;dur=4,content-info;desc=\"width=200,height=200,owidth=,oheight=,obytes=48210\"
server: Cloudinary
timing-allow-origin: *
access-control-allow-origin: *
accept-ranges: bytes
x-content-type-options: nosniff
access-control-expose-headers: Content-Length,ETag,Server-Timing,Vary,X-Content-Type-Options
content-length: 2004
----
--Request 
GET https://www.facebook.com/tr/?id=1369867960112522&ev=AddToCart&dl=https%3A%2F%2Fwww.croma.com%2Foneplus-12r-5g-8gb-128gb-cool-blue-%2Fp%2F304697&rl=https%3A%2F%2Fwww.croma.com%2Fcampaign%2Foneplus-r-5g%2Fc%2F6407%3Fq%3D%253Aprice-asc&if=false&ts=1715839373184&cd[value]=39999.00&cd[currency]=INR&cd[content_ids]=%5B%22304697%22%5D&cd[content_type]=product&cd[content_name]=OnePlus%2012R%205G%20(8GB%2C%20128GB%2C%20Cool%20Blue)&sw=1523&sh=650&ud[external_id]=36ce52f2c012a86c9264c805b8cff82e07250268c3b1663e92a631306623bfc6&v=2.9.156&r=stable&ec=4&o=4126&fbp=fb.1.1715839140634.281453602&ler=empty&cdl=API_unavailable&it=1715839205604&coo=false&eid=11146789180925&tm=1&rqm=GET
Host: www.facebook.com
sec-ch-ua: \"Not.A/Brand\";v=\"8\", \"Chromium\";v=\"114\"
sec-ch-ua-mobile: ?0
User-Agent: Mozilla/5.0 (X11; Linux x86_64) AppleWebKit/537.36 (KHTML, like Gecko) Chrome/114.0.0.0 Safari/537.36
sec-ch-ua-platform: \"Linux\"
Accept: image/avif,image/webp,image/apng,image/svg+xml,image/*,*/*;q=0.8
Sec-Fetch-Site: cross-site
Sec-Fetch-Mode: no-cors
Sec-Fetch-Dest: image
Referer: https://www.croma.com/
Accept-Encoding: gzip, deflate, br
Accept-Language: en-US,en;q=0.9
----
--Response 
HTTP/1.1 302
cache-control: no-cache, no-store, must-revalidate
pragma: no-cache
expires: 0
date: Thu, 16 May 2024 06:02:53 GMT
set-cookie: fr=0Z3NkJ8CDgsVU7QbM..BmRaGN...1.0.BmRaGN.; expires=Wednesday, 14-Aug-2024 06:02:53 GMT; path=/; domain=.facebook.com; SameSite=None; HttpOnly; secure
location: /tr/?cd[content_ids]=%5B%22304697%22%5D&cd[content_name]=OnePlus%2012R%205G%20(8GB%2C%20128GB%2C%20Cool%20Blue)&cd[content_type]=product&cd[currency]=INR&cd[value]=39999.00&cdl=API_unavailable&coo=false&dl=https%3A%2F%2Fwww.croma.com%2Foneplus-12r-5g-8gb-128gb-cool-blue-%2Fp%2F304697&ec=4&eid=11146789180925&ev=AddToCart&fbp=fb.1.1715839140634.281453602&id=1369867960112522&if=false&it=1715839205604&ler=empty&o=4126&r=stable&redirect=0&rl=https%3A%2F%2Fwww.croma.com%2Fcampaign%2Foneplus-r-5g%2Fc%2F6407%3Fq%3D%253Aprice-asc&rqm=GET&sh=650&sw=1523&tm=1&ts=1715839373184&ud[external_id]=36ce52f2c012a86c9264c805b8cff82e07250268c3b1663e92a631306623bfc6&v=2.9.156
strict-transport-security: max-age=31536000; includeSubDomains
cross-origin-resource-policy: cross-origin
content-type: text/plain
content-length: 0
server: proxygen-bolt
x-fb-connection-quality: EXCELLENT; q=0.9, rtt=11, rtx=0, c=22, mss=1232, tbw=3929, tp=14, tpl=0, uplat=1, ullat=1
alt-svc: h3=\":443\"; ma=86400
priority: u=3,i
----

