/Electrical/Passives/Resistors,"{Resistance} {Tolerance} {Wattage} {Package} resistor",Resistance=Ω=metric,Tolerance=%=metric,Wattage=W=metric,Package,Composition,Property/With/Slashes,
/Electrical/Passives/Capacitors,"{Capacitance} {Tolerance} {Package} capacitor",Capacitance=F=metric,Tolerance=%=metric,Package,,,,
/Electrical/Passives/Inductors,"{Inductance} {Tolerance} {Package} inductor",Inductance=H=metric,Tolerance=%=metric,Package,,,,
/Electrical/Connectors/Header Pins,"{Length}x{Width} {Pins} {Pitch} {Gender} header pins",Length,Width,Pins,Pitch=m=metric,Mount,Orientation,Gender
/Electrical/Connectors/USB,"USB {Type} {Mount} connector",Type,,,,Mount,Orientation,Gender
/Electrical/Connectors/Power/Barrel Jacks,"{Outer}x{Inner} barrel jack",Inner=m=metric,Outer=m=metric,,,,,
/Electrical/Connectors/Power/XT,"XT{Current}",Current,,,,,,
/Electrical/Connectors/Power/NEMA,"NEMA {Nema} {Gender} {Mount}",Nema,Gender,Mount,,,,
/Electrical/Connectors/DSUB,"{Pins} {Orientation} {Mount} D-Sub connector",Pins,Orientation,Mount
/Electrical/Switches,"{Connection Type} {Switch Type} {Mount} {Orientation} {Description}",Connection Type,Switch Type,Mount,Orientation,Description
/Electrical/Active/Transistors/MOSFETs,"{Channel} {Current} {Package} MOSFET",Channel,Current=A=metric,Package,Vgs=V=metric,Vds=V=metric,Gate Capacitance=F=metric,Rds On=Ω=metric
/Electrical/Active/Transistors/BJTs,"{Type} {Package} BJT",Type,Beta,Package
/Electrical/Active/Diodes,"{Forward Voltage} {Current} {Type} {Package} diode",Forward Voltage=V=metric,Current=A=metric,Type,Package
/Electrical/Active/Logic/Gates,"{Inputs} input, {Channels} channel {Type} {Package} gate",Type,Inputs,Channels,Package
/Electrical/Active/Logic/Latches,"{Channels} channel {Type} {Package} latch",Type,Channels,Package
/Electrical/Active/Memory,"{Words}x{Bits} {Type} memory",Type,Words,Bits
/Electrical/Active/Microcontrollers,,
/Mechanical/Fasteners/Metric,"M{Diameter}",Diameter=m=metric
/Mechanical/Fasteners/Metric/Screws,"M{Diameter}x{Pitch} {Length} {Head} screw",Pitch=m=metric,Length=m=metric,Head
/Mechanical/Fasteners/Metric/Nuts,"M{Diameter}x{Pitch} {Thickness} {Shape} nut",Pitch=m=metric,Thickness=m=metric,Shape
/Mechanical/Fasteners/Metric/Washers,"M{Diameter} washer"
/Mechanical/Fasteners/Imperial,"{Diameter} diameter", Diameter=in
/Mechanical/Fasteners/Imperial/Screws,"{Diameter}-{Pitch} {Length} {Head} screw",Pitch=in,Length=in,Head
/Mechanical/Fasteners/Imperial/Nuts,"{Diameter}-{Pitch} {Thickness} {Shape} nut",Pitch=in,Thickness=in,Shape
/Mechanical/Fasteners/Imperial/Washers,"{Diameter} washer"