Access CC 2009, Exclusive scalable database, 2
Access CC 2009, Customizable exuding internet solution, 3
Emulation SL-Class 2010, Exclusive scalable database, 3
Emulation SL-Class 2010, Customizable exuding internet solution, 5
Emulation SL-Class 2010, Pre-emptive user-facing projection, 4
Profit-focused Savana 3500 2006, Exclusive scalable database, 6
Profit-focused Savana 3500 2006, Customizable exuding internet solution, 1
Profit-focused Savana 3500 2006, Pre-emptive user-facing projection, 3
Profit-focused Savana 3500 2006, Innovative cohesive collaboration, 5
