{
    "type": "application",
    "source-directories": [
        "src"
    ],
    "elm-version": "0.19.0",
    "dependencies": {
        "direct": {
            "NoRedInk/elm-sortable-table": "1.0.0",
            "dillonkearns/elm-graphql": "4.3.1",
            "elm/browser": "1.0.1",
            "elm/core": "1.0.2",
            "elm/html": "1.0.0",
            "elm/json": "1.1.3",
            "elm/url": "1.0.0"
        },
        "indirect": {
            "Skinney/murmur3": "2.0.8",
            "elm/bytes": "1.0.8",
            "elm/file": "1.0.5",
            "elm/http": "2.0.0",
            "elm/regex": "1.0.0",
            "elm/time": "1.0.0",
            "elm/virtual-dom": "1.0.2",
            "elm-community/list-extra": "8.2.2",
            "lukewestby/elm-string-interpolate": "1.0.4"
        }
    },
    "test-dependencies": {
        "direct": {},
        "indirect": {}
    }
}