digraph overall {
    graph [fontsize=16];
    node [fontsize=14 splines=ortho shape=rectangle];
    edge [fontsize=12];
    rankdir=TB;
    splines=ortho
    ranksep=10
    nodesep=5

    subgraph cluster_hardware_in {
        label = "Hardware In";
        color = black;

        hardware_in_hot_button [label = "Hot Button"]
        hardware_in_cold_button [label ="Cold Button"]
        hardware_in_close_button [label = "Close Button"]

        hardware_in_position_top [label = "Position Top"]
        hardware_in_position_middle [label = "Position Middle"]
        hardware_in_position_bottom [label = "Position Bottom"]

        hardware_in_temp_hot_peltier_raw [label = "Temp Hot Peltier Raw"]
        hardware_in_temp_cold_peltier_raw [label = "Temp Cold Peltier Raw"]
        hardware_in_temp_hot_air_raw [label = "Temp Hot Peltier Raw"]
        hardware_in_temp_cold_air_raw [label = "Temp Cold Peltier Raw"]

        hardware_in_fan_hot_err [label = "Fan Hot Error"]
        hardware_in_fan_cold_err [label = "Fan Cold Error"]
    }

    subgraph cluster_user_input {
        label = "User Input";
        color = black;

        subgraph cluster_user_input_in {
            label = "IN";
            color=black;

            user_input_in_hot_button [label = "Hot Button"]
            user_input_in_cold_button [label ="Cold Button"]
            user_input_in_close_button [label = "Close Button"]

            user_input_in_actual_position [label = "Actual Position"]
            user_input_in_desired_position [label = "Desired Position"]

            user_input_in_open_close_err [label = "Open Close Err"]
            user_input_in_open_timeout [label = "Open Timeout"]
        }

        subgraph cluster_user_input_out {
            label = "OUT";
            color = black;

            user_input_out_desired_position [label = "Desired Position"]
        }
    }

    subgraph cluster_open_close {
        label = "Open Close";
        color = black;

        subgraph cluster_open_close_in {
            label = "IN";
            color = black;

            open_close_in_position_top [label = "Position Top"]
            open_close_in_position_middle [label = "Position Middle"]
            open_close_in_position_bottom [label = "Position Bottom"]

            open_close_in_desired_position [label = "Desired Position"]
        }

        subgraph cluster_open_close_out {
            label = "OUT";
            color = black;

            open_close_out_actual_position [label = "Actual Position"]
            open_close_out_open_close_err [label = "Open Close Error"]
            open_close_out_bellow_state [label = "Bellow State"]
        }
    }

    subgraph cluster_temperature_control {
        label = "Temperature Control";
        color = black;

        subgraph cluster_temperature_control_in {
            label = "IN";
            color = black;

            temperature_control_actual_position [label = "Actual Position"]

            temperature_control_in_temp_hot_peltier_raw [label = "Temp Hot Peltier Raw"]
            temperature_control_in_temp_cold_peltier_raw [label = "Temp Cold Peltier Raw"]
            temperature_control_in_temp_hot_air_raw [label = "Temp Hot Peltier Raw"]
            temperature_control_in_temp_cold_air_raw [label = "Temp Cold Peltier Raw"]

            temperature_control_in_fan_hot_err [label = "Fan Hot Error"]
            temperature_control_in_fan_cold_err [label = "Fan Cold Error"]

            temperature_control_in_peltier [label = "Peltier"]
        }

        subgraph cluster_temperature_control_out {
            label = "OUT";
            color = black;

            temperature_control_out_temp_hot_peltier [label = "Temp Hot Peltier"]
            temperature_control_out_temp_cold_peltier [label = "Temp Cold Peltier"]
            temperature_control_out_temp_hot_air [label = "Temp Hot Peltier"]
            temperature_control_out_temp_cold_air [label = "Temp Cold Peltier"]

            temperature_control_out_fan_hot [label = "Fan Hot"]
            temperature_control_out_fan_cold [label = "Fan Cold"]

            temperature_control_out_peltier [label = "Peltier"]
        }
    }

    subgraph cluster_lighting {
        label = "Lighting"
        color = black

        subgraph cluster_lighting_in {
            label = "IN"
            color = black

            lighting_in_actual_position [label = "Actual Position"]
            lighting_in_desired_position [label = "Desired Position"]

            lighting_in_temp_hot_peltier_raw [label = "Temp Hot Peltier Raw"]
            lighting_in_temp_cold_peltier_raw [label = "Temp Cold Peltier Raw"]
            lighting_in_temp_hot_air_raw [label = "Temp Hot Peltier Raw"]
            lighting_in_temp_cold_air_raw [label = "Temp Cold Peltier Raw"]

            lighting_in_fan_hot_err [label = "Fan Hot Error"]
            lighting_in_fan_cold_err [label = "Fan Cold Error"]

            lighting_in_open_close_err [label = "Open Close Error"]
        }

        subgraph cluster_lighting_out {
            label = "OUT"
            color = black

            lighting_out_led_ring_4 [label = "LED Ring 4"]
            lighting_out_led_ring_3 [label = "LED Ring 3"]
            lighting_out_led_ring_2 [label = "LED Ring 2"]
            lighting_out_led_ring_1 [label = "LED Ring 1"]
            lighting_out_led_ring_0 [label = "LED Ring 0"]

            lighting_out_led_button_hot
            lighting_out_led_button_cold [label = "LED Button Cold"]
            lighting_out_led_button_close [label = "LED Button Close"]

            lighting_out_led_chamber_hot [label = "LED Chamber Hot"]
            lighting_out_led_chamber_cold [label = "LED Chamber Cold"]
        }
    }

    subgraph cluster_hardware_out {
        label = "Hardware Out"
        color = black

        hardware_out_peltier [label = "Pelter"]
        hardware_out_bellow_state [label = "Bellow State"]

        hardware_out_led_ring_4 [label = "LED Ring 4"]
        hardware_out_led_ring_3 [label = "LED Ring 3"]
        hardware_out_led_ring_2 [label = "LED Ring 2"]
        hardware_out_led_ring_1 [label = "LED Ring 1"]
        hardware_out_led_ring_0 [label = "LED Ring 0"]

        hardware_out_led_button_hot [label = "LED Button Hot"]
        hardware_out_led_button_cold [label = "LED Button Cold"]
        hardware_out_led_button_close [label = "LED Button Close"]

        hardware_out_led_chamber_hot [label = "LED Chamber Hot"]
        hardware_out_led_chamber_cold [label = "LED Chamber Cold"]
    }
hardware_in_hot_button -> user_input_in_hot_button
    hardware_in_cold_button -> user_input_in_cold_button
    hardware_in_close_button -> user_input_in_close_button
    hardware_in_position_top -> open_close_in_position_top
    hardware_in_position_middle -> open_close_in_position_middle
    hardware_in_position_bottom -> open_close_in_position_bottom
    hardware_in_temp_hot_peltier_raw -> temperature_control_in_temp_hot_peltier_raw
    hardware_in_temp_cold_peltier_raw -> temperature_control_in_temp_cold_peltier_raw
    hardware_in_temp_hot_air_raw -> temperature_control_in_temp_hot_air_raw
    hardware_in_temp_cold_air_raw -> temperature_control_in_temp_cold_air_raw

    user_input_out_desired_position -> user_input_in_desired_position
    user_input_out_desired_position -> lighting_in_desired_position

    temperature_control_out_temp_hot_peltier -> lighting_in_temp_hot_peltier_raw
    temperature_control_out_temp_cold_peltier -> lighting_in_temp_cold_peltier_raw
    temperature_control_out_temp_hot_air -> lighting_in_temp_hot_air_raw
    temperature_control_out_temp_cold_air -> lighting_in_temp_cold_air_raw

    hardware_in_fan_hot_err -> lighting_in_fan_hot_err
    hardware_in_fan_cold_err -> lighting_in_fan_cold_err

    open_close_out_actual_position -> user_input_in_actual_position
    open_close_out_actual_position -> temperature_control_actual_position
    open_close_out_actual_position -> lighting_in_actual_position
    open_close_out_bellow_state -> hardware_out_bellow_state

    temperature_control_out_peltier -> temperature_control_in_peltier
    temperature_control_out_peltier -> hardware_out_peltier

    lighting_out_led_ring_4 -> hardware_out_led_ring_4
    lighting_out_led_ring_3 -> hardware_out_led_ring_3
    lighting_out_led_ring_2 -> hardware_out_led_ring_2
    lighting_out_led_ring_1 -> hardware_out_led_ring_1
    lighting_out_led_ring_0 -> hardware_out_led_ring_0
    lighting_out_led_button_hot -> hardware_out_led_button_hot
    lighting_out_led_button_cold -> hardware_out_led_button_cold
    lighting_out_led_button_close -> hardware_out_led_button_close
    lighting_out_led_chamber_hot -> hardware_out_led_chamber_hot
    lighting_out_led_chamber_cold -> hardware_out_led_chamber_cold
}
