{
    // Use IntelliSense to learn about possible attributes.
    // Hover to view descriptions of existing attributes.
    // For more information, visit: https://go.microsoft.com/fwlink/?linkid=830387
    "version": "0.2.0",
    "configurations": [
        {
            "name": "Launch Chrome",
            "request": "launch",
            "type": "pwa-chrome",
            "url": "http://localhost:3001",
            "preLaunchTask": "Rebuild Site"
        },
        {
            "type": "pwa-msedge",
            "request": "launch",
            "name": "Launch Edge",
            "url": "http://localhost:3001",
            "preLaunchTask": "Rebuild Site"
        }
    ]
}