{
    "uid": "IDF_Functions",
    "TRN_EVL_ID": "IDF",
    "NETWORK": "Commercial",
    "KSATs": [
        [
            "K0009",
            "B"
        ],
        [
            "A0061",
            "3"
        ],
        [
            "K0011",
            "B"
        ],
        [
            "K0012",
            "B"
        ],
        [
            "S0052",
            "3"
        ],
        [
            "K0102",
            "B"
        ],
        [
            "S0085",
            "3"
        ],
        [
            "K0737",
            "B"
        ],
        [
            "S0049",
            "3"
        ],
        [
            "K0738",
            "B"
        ],
        [
            "S0050",
            "3"
        ],
        [
            "K0739",
            "B"
        ],
        [
            "S0051",
            "3"
        ]
    ],
    "course": "IDF",
    "module": "C-Programming",
    "topic": "Functions",
    "subject": "Functions",
    "lecture_time": 0,
    "perf_demo_time": 0,
    "references": ["Deitel, How to program in C", "Ritchie, The C Programming Language"],
    "lesson_objectives": [],
    "performance_objectives": [],
    "workroles": [
        "basic-dev"
    ]
}