{
  "main": {
    "id": "9d0255f31ad2242e",
    "type": "split",
    "children": [
      {
        "id": "61621f7e5a12d9aa",
        "type": "tabs",
        "children": [
          {
            "id": "86cad73af83747f1",
            "type": "leaf",
            "state": {
              "type": "markdown",
              "state": {
                "file": "world systems/lore/lore hub.md",
                "mode": "source",
                "source": false
              }
            }
          }
        ]
      }
    ],
    "direction": "vertical"
  },
  "left": {
    "id": "ce23e00f6e67bf5e",
    "type": "split",
    "children": [
      {
        "id": "1e744fecb7b69a80",
        "type": "tabs",
        "children": [
          {
            "id": "3d9fd86347191719",
            "type": "leaf",
            "state": {
              "type": "file-explorer",
              "state": {
                "sortOrder": "alphabetical"
              }
            }
          },
          {
            "id": "8a778097473e6290",
            "type": "leaf",
            "state": {
              "type": "search",
              "state": {
                "query": "",
                "matchingCase": false,
                "explainSearch": false,
                "collapseAll": false,
                "extraContext": false,
                "sortOrder": "alphabetical"
              }
            }
          },
          {
            "id": "bc59197bdd2a5c16",
            "type": "leaf",
            "state": {
              "type": "bookmarks",
              "state": {}
            }
          }
        ]
      }
    ],
    "direction": "horizontal",
    "width": 287.5
  },
  "right": {
    "id": "1e702d91c14a9aad",
    "type": "split",
    "children": [
      {
        "id": "5a7eef6580489c49",
        "type": "tabs",
        "children": [
          {
            "id": "6325530511e5d31c",
            "type": "leaf",
            "state": {
              "type": "backlink",
              "state": {
                "file": "world systems/lore/lore hub.md",
                "collapseAll": false,
                "extraContext": false,
                "sortOrder": "alphabetical",
                "showSearch": false,
                "searchQuery": "",
                "backlinkCollapsed": false,
                "unlinkedCollapsed": true
              }
            }
          },
          {
            "id": "e8ca42f77b5b2494",
            "type": "leaf",
            "state": {
              "type": "outgoing-link",
              "state": {
                "file": "world systems/lore/lore hub.md",
                "linksCollapsed": false,
                "unlinkedCollapsed": true
              }
            }
          },
          {
            "id": "450b18b0a38b39a1",
            "type": "leaf",
            "state": {
              "type": "tag",
              "state": {
                "sortOrder": "frequency",
                "useHierarchy": true
              }
            }
          },
          {
            "id": "901990c43716d925",
            "type": "leaf",
            "state": {
              "type": "outline",
              "state": {
                "file": "world systems/lore/lore hub.md"
              }
            }
          }
        ],
        "currentTab": 3
      }
    ],
    "direction": "horizontal",
    "width": 300,
    "collapsed": true
  },
  "left-ribbon": {
    "hiddenItems": {
      "switcher:Open quick switcher": false,
      "graph:Open graph view": false,
      "canvas:Create new canvas": false,
      "daily-notes:Open today's daily note": false,
      "templates:Insert template": false,
      "command-palette:Open command palette": false
    }
  },
  "active": "86cad73af83747f1",
  "lastOpenFiles": [
    "world systems/lore/the eternal war.md",
    "world systems/lore/the old web.md",
    "world systems/lore/the kindling.md",
    "Parable.md",
    "world systems/lore/organizations/third letter.md",
    "world systems/lore/organizations/the kindred.md",
    "world systems/lore/organizations/the cylate.md",
    "world systems/lore/lore hub.md",
    "world systems/lore/organizations/organization hub.md",
    "conflict-files-obsidian-git.md",
    "world systems/lore/locations/the city of parable.md",
    "movement and combat systems/exploits/edgecancelling.md",
    "world systems/lore/organizations",
    "player progression systems/precepts/precept of the missile.md",
    "player progression systems/precepts/precept of the projectile.md",
    "player progression systems/precepts/precept of the gunslinger.md",
    "player progression systems/precepts/precept of the breath.md",
    "player progression systems/precepts/precept of the silent.md",
    "movement and combat systems/exploits/exploit hub.md",
    "world systems/locations/location hub.md",
    "player progression systems/spec hub.md",
    "movement and combat systems/statuses/status hub.md",
    "world systems/lore/the apocalypse.md",
    "movement and combat systems/exploits",
    "world systems/lore/characters/character hub.md",
    "world systems/lore/characters/sources/source hub.md",
    "world systems/lore/characters/sources/Dr. London.md",
    "world systems/lore/characters/sources/DIVINO.md",
    "Untitled.canvas",
    "ui systems",
    "engine systems",
    "world systems",
    "misc systems",
    "social systems",
    "game systems/Untitled",
    "movement and combat systems",
    "world management systems",
    "Untitled 1.canvas"
  ]
}