{
  "collapse-filter": false,
  "search": "",
  "showTags": false,
  "showAttachments": false,
  "hideUnresolved": false,
  "showOrphans": true,
  "collapse-color-groups": true,
  "colorGroups": [],
  "collapse-display": true,
  "showArrow": false,
  "textFadeMultiplier": 0,
  "nodeSizeMultiplier": 1,
  "lineSizeMultiplier": 1,
  "collapse-forces": true,
  "centerStrength": 0.352986653645833,
  "repelStrength": 10.3963216145833,
  "linkStrength": 1,
  "linkDistance": 168,
<<<<<<< HEAD
  "scale": 0.5480219651973705,
=======
  "scale": 0.22157843323276885,
>>>>>>> origin/main
  "close": true
}