{
	"home_guild_id": 818438845083156530,
	"welcome_channel_id": 818438845083156533,
	"test_channel_id": 865785455034105857,

	"engine": "babbage:ft-8oc-2022-12-11-05-49-28",

	"ignore_channels": [865785455034105857],

	"alts": {
		"1036213280542306414": ["240883746323038208"]
	}
}