<?xml version="1.0" encoding="UTF-8" standalone="no"?>
<!-- Created with Inkscape (http://www.inkscape.org/) -->

<svg
   width="83.655579mm"
   height="53.380585mm"
   viewBox="0 0 83.655579 53.380585"
   version="1.1"
   id="svg1"
   inkscape:version="1.3.2 (091e20e, 2023-11-25, custom)"
   sodipodi:docname="logo_night.svg"
   inkscape:export-filename="logo_night.png"
   inkscape:export-xdpi="96"
   inkscape:export-ydpi="96"
   xmlns:inkscape="http://www.inkscape.org/namespaces/inkscape"
   xmlns:sodipodi="http://sodipodi.sourceforge.net/DTD/sodipodi-0.dtd"
   xmlns="http://www.w3.org/2000/svg"
   xmlns:svg="http://www.w3.org/2000/svg">
  <sodipodi:namedview
     id="namedview1"
     pagecolor="#ffffff"
     bordercolor="#000000"
     borderopacity="0.25"
     inkscape:showpageshadow="2"
     inkscape:pageopacity="0.0"
     inkscape:pagecheckerboard="0"
     inkscape:deskcolor="#d1d1d1"
     inkscape:document-units="mm"
     inkscape:zoom="1.0242632"
     inkscape:cx="202.58464"
     inkscape:cy="316.81309"
     inkscape:window-width="1920"
     inkscape:window-height="1009"
     inkscape:window-x="-8"
     inkscape:window-y="-8"
     inkscape:window-maximized="1"
     inkscape:current-layer="layer1"
     showguides="false" />
  <defs
     id="defs1">
    <inkscape:path-effect
       effect="fillet_chamfer"
       id="path-effect17"
       is_visible="true"
       lpeversion="1"
       nodesatellites_param="F,0,0,1,0,6.6600472,0,1 @ F,0,1,1,0,27.268441,0,1 @ F,0,0,1,0,6.6600472,0,1 @ F,0,1,1,0,27.268441,0,1"
       radius="0"
       unit="px"
       method="auto"
       mode="F"
       chamfer_steps="1"
       flexible="false"
       use_knot_distance="true"
       apply_no_radius="true"
       apply_with_radius="true"
       only_selected="false"
       hide_knots="false" />
  </defs>
  <g
     inkscape:label="Layer 1"
     inkscape:groupmode="layer"
     id="layer1"
     style="display:inline"
     transform="translate(-42.867708,-37.867708)">
    <path
       id="rect16"
       style="display:inline;fill:#000000;fill-opacity:1;stroke:#f7f7ff;stroke-width:0.264583;stroke-dasharray:none;stroke-opacity:1"
       d="M 49.660047,38 H 99.122559 A 27.268441,27.268441 45 0 1 126.391,65.268441 l 0,19.187513 a 6.6600472,6.6600472 135 0 1 -6.66005,6.660047 H 70.268441 A 27.268441,27.268441 45 0 1 43,63.84756 V 44.660047 A 6.6600472,6.6600472 135 0 1 49.660047,38 Z"
       inkscape:path-effect="#path-effect17"
       inkscape:original-d="m 43,38 h 83.391 V 91.116001 H 43 Z"
       inkscape:label="blob" />
    <g
       id="g16"
       transform="translate(-4.8886973e-5,-65)"
       style="fill:#f7f7ff;fill-opacity:1"
       inkscape:label="7dub">
      <path
         id="path14"
         style="font-size:192px;line-height:0.8;font-family:Dosis;-inkscape-font-specification:Dosis;letter-spacing:0px;white-space:pre;fill:#f7f7ff;fill-opacity:1;stroke-width:49.9999"
         d="m 101.86474,110 c -0.44027,0 -0.82974,0.11847 -1.16841,0.35554 -0.3048,0.2032 -0.45733,0.50827 -0.45733,0.91467 v 36.16937 c 0,0.33867 0.15253,0.64374 0.45733,0.91467 0.33867,0.27094 0.72814,0.40618 1.16841,0.40618 0.44026,0 0.81244,-0.13524 1.11724,-0.40618 0.3048,-0.27093 0.45734,-0.576 0.45734,-0.91467 v -2.23501 c 0.54187,1.04987 1.43928,1.96406 2.69234,2.74299 1.25307,0.77893 2.67571,1.1684 4.26744,1.1684 1.6256,0 3.11586,-0.44032 4.47053,-1.32085 1.35466,-0.9144 2.43816,-2.11636 3.25096,-3.60649 0.84667,-1.49014 1.27021,-3.06532 1.27021,-4.72478 v -5.48649 c 0,-1.76106 -0.42354,-3.3525 -1.27021,-4.7749 -0.8128,-1.45627 -1.91359,-2.6079 -3.30212,-3.45457 -1.35467,-0.88053 -2.86171,-1.32085 -4.52117,-1.32085 -1.65947,0 -3.06482,0.40676 -4.21628,1.21956 -1.1176,0.77894 -1.96417,1.65905 -2.5399,2.64119 v -17.01757 c 0,-0.4064 -0.16931,-0.71147 -0.50798,-0.91467 C 102.72834,110.11847 102.33887,110 101.86474,110 Z m 7.87393,17.47542 c 1.18534,0 2.25206,0.32134 3.20033,0.9648 0.94826,0.6096 1.71043,1.40584 2.28616,2.38797 0.57573,0.98213 0.86351,2.03156 0.86351,3.14916 v 5.48649 c 0,1.1176 -0.28778,2.18432 -0.86351,3.20032 -0.57573,1.016 -1.3379,1.84579 -2.28616,2.48925 -0.94827,0.6096 -1.99822,0.91468 -3.14968,0.91468 -1.15147,0 -2.20141,-0.30508 -3.14968,-0.91468 -0.94827,-0.64346 -1.70992,-1.35427 -2.28565,-2.1332 -0.54187,-0.8128 -0.81287,-1.47327 -0.81287,-1.98127 v -7.06159 c 0,-1.38853 0.30456,-2.55643 0.91416,-3.50469 0.6096,-0.94827 1.38854,-1.67688 2.3368,-2.18488 0.94827,-0.54187 1.9306,-0.81236 2.94659,-0.81236 z"
         inkscape:label="b" />
      <path
         id="text2"
         style="font-size:192px;line-height:0.8;font-family:Dosis;-inkscape-font-specification:Dosis;letter-spacing:0px;white-space:pre;fill:#f7f7ff;fill-opacity:1;stroke-width:49.9999"
         d="m 80.611384,124.73192 c -0.440266,0 -0.829738,0.13576 -1.168405,0.4067 -0.338667,0.27093 -0.507979,0.57549 -0.507979,0.91415 v 13.51287 c 0,1.65947 0.423024,3.23413 1.269691,4.72426 0.88053,1.45627 2.048946,2.62468 3.50521,3.50521 1.490133,0.88053 3.132934,1.32085 4.927865,1.32085 1.7272,0 3.318637,-0.44032 4.774903,-1.32085 1.490131,-0.88053 2.658547,-2.03217 3.505214,-3.45457 0.880527,-1.45626 1.320834,-3.0477 1.320834,-4.7749 v -13.56351 c 0,-0.37254 -0.15253,-0.67761 -0.457327,-0.91467 -0.27093,-0.23707 -0.660407,-0.35554 -1.168404,-0.35554 -0.440263,0 -0.829732,0.11847 -1.168399,0.35554 -0.338666,0.23706 -0.507981,0.54213 -0.507981,0.91467 v 13.56351 c 0,1.1176 -0.28778,2.18432 -0.863513,3.20032 -0.541867,0.98213 -1.28674,1.77785 -2.235004,2.38745 -0.948267,0.6096 -2.032283,0.91468 -3.251483,0.91468 -1.185331,0 -2.252054,-0.30508 -3.200321,-0.91468 -0.948266,-0.64346 -1.709914,-1.45596 -2.285648,-2.43809 -0.575733,-0.98213 -0.864031,-2.03208 -0.864031,-3.14968 v -13.51287 c 0,-0.33866 -0.169312,-0.64322 -0.507979,-0.91415 -0.3048,-0.27094 -0.676979,-0.4067 -1.117243,-0.4067 z"
         inkscape:label="u" />
      <path
         id="path15"
         style="font-size:192px;line-height:0.8;font-family:Dosis;-inkscape-font-specification:Dosis;letter-spacing:0px;white-space:pre;fill:#f7f7ff;fill-opacity:1;stroke-width:188.976"
         d="m 76.109386,291.30011 c -1.407999,0 -2.751252,0.51116 -4.03125,1.53516 -1.279999,1.024 -1.919922,2.17703 -1.919922,3.45703 v 16.32031 c 0,0.768 0.192172,1.6635 0.576172,2.6875 0.255999,1.024 0.70375,2.04827 1.34375,3.07227 l 28.371094,55.30859 c -8.8e-4,0.004 -0.003,0.008 -0.004,0.0117 10.29631,20.12423 20.65405,40.21693 30.98779,60.32194 0.87536,1.70313 2.79267,3.71077 4.88323,4.19441 4.48744,1.03816 8.76815,-0.62374 13.37117,-3.4851 4.864,-2.944 8.25578,-6.39919 10.17578,-10.36719 v 8.44727 c 0,1.28 0.57652,2.43303 1.72852,3.45703 1.28,1.024 2.68669,1.53516 4.22265,1.53516 1.92,0 3.39202,-0.51116 4.41602,-1.53516 1.152,-1.024 1.72852,-2.17703 1.72852,-3.45703 V 296.10089 c 0,-1.536 -0.57652,-2.68903 -1.72852,-3.45703 -1.024,-0.896 -2.49602,-1.34375 -4.41602,-1.34375 -1.66396,0 -3.13601,0.44775 -4.41601,1.34375 -1.28,0.768 -1.91992,1.92103 -1.91992,3.45703 v 64.31836 c -2.048,-3.712 -5.24765,-7.03842 -9.59961,-9.98242 -4.224,-3.072 -9.47218,-4.60938 -15.74414,-4.60938 -6.272,0 -12.03134,1.66423 -17.2793,4.99219 -3.82387,2.33164 -7.09743,5.28284 -9.83398,8.83789 L 82.830089,313.38019 V 303.013 h 54.527341 v 22.07813 c 0,1.27999 0.63993,2.43303 1.91993,3.45703 1.27999,1.024 2.75201,1.53515 4.41601,1.53515 1.664,0 3.13602,-0.51115 4.41602,-1.53515 1.28,-1.024 1.91992,-2.17704 1.91992,-3.45703 V 296.2923 c 0,-1.28 -0.57457,-2.43303 -1.72656,-3.45703 -1.28,-1.024 -2.62521,-1.53516 -4.03321,-1.53516 z m 59.945314,66.04883 c 3.84,0 7.55272,1.02231 11.13672,3.07031 3.58396,1.92 6.52803,4.67385 8.83203,8.25781 2.304,3.584 3.45508,7.9981 3.45508,13.2461 v 26.68945 c 0,1.92 -1.02427,4.41632 -3.07227,7.48828 -2.048,2.944 -4.8633,5.63054 -8.44726,8.0625 -1.78339,1.18893 -3.72244,2.06495 -5.8125,2.64063 -9.37952,-17.92214 -18.75703,-35.84534 -28.13263,-53.76953 0.42466,-1.02203 0.92001,-2.02761 1.49805,-3.01368 2.176,-3.71196 5.05471,-6.72139 8.63867,-9.02539 3.584,-2.43196 7.5523,-3.64648 11.9043,-3.64648 z"
         transform="matrix(0.26458333,0,0,0.26458333,31.437355,32.926851)"
         inkscape:label="7d"
         sodipodi:nodetypes="ssssccccsaccscscsscscsccscccccsssssscssccsssccccsccc" />
    </g>
  </g>
</svg>
