%YAML 1.1
%TAG !u! tag:unity3d.com,2011:
--- !u!21 &2100000
Material:
  serializedVersion: 8
  m_ObjectHideFlags: 0
  m_CorrespondingSourceObject: {fileID: 0}
  m_PrefabInstance: {fileID: 0}
  m_PrefabAsset: {fileID: 0}
  m_Name: FloorRoomHexa00_00
  m_Shader: {fileID: 46, guid: 0000000000000000f000000000000000, type: 0}
  m_ValidKeywords:
  - _METALLICGLOSSMAP
  - _NORMALMAP
  - _PARALLAXMAP
  m_InvalidKeywords: []
  m_LightmapFlags: 4
  m_EnableInstancingVariants: 0
  m_DoubleSidedGI: 0
  m_CustomRenderQueue: -1
  stringTagMap: {}
  disabledShaderPasses: []
  m_SavedProperties:
    serializedVersion: 3
    m_TexEnvs:
    - _BumpMap:
        m_Texture: {fileID: 2800000, guid: da4d73d24c3f50f4981e9bb4c66bcd98, type: 3}
        m_Scale: {x: 1, y: 1}
        m_Offset: {x: 0, y: 0}
    - _DetailAlbedoMap:
        m_Texture: {fileID: 0}
        m_Scale: {x: 1, y: 1}
        m_Offset: {x: 0, y: 0}
    - _DetailMask:
        m_Texture: {fileID: 0}
        m_Scale: {x: 1, y: 1}
        m_Offset: {x: 0, y: 0}
    - _DetailNormalMap:
        m_Texture: {fileID: 0}
        m_Scale: {x: 1, y: 1}
        m_Offset: {x: 0, y: 0}
    - _EmissionMap:
        m_Texture: {fileID: 0}
        m_Scale: {x: 1, y: 1}
        m_Offset: {x: 0, y: 0}
    - _IBLMap:
        m_Texture: {fileID: 0}
        m_Scale: {x: 1, y: 1}
        m_Offset: {x: 0, y: 0}
    - _MainTex:
        m_Texture: {fileID: 2800000, guid: 68f673a7e0bbf434d9e16d85df8c622d, type: 3}
        m_Scale: {x: 1, y: 1}
        m_Offset: {x: 0, y: 0}
    - _MetallicGlossMap:
        m_Texture: {fileID: 2800000, guid: b6118369ea1eb944aab3c798f539874b, type: 3}
        m_Scale: {x: 1, y: 1}
        m_Offset: {x: 0, y: 0}
    - _OcclusionMap:
        m_Texture: {fileID: 2800000, guid: 24763291750ffb240aade30ad76ddfff, type: 3}
        m_Scale: {x: 1, y: 1}
        m_Offset: {x: 0, y: 0}
    - _ParallaxMap:
        m_Texture: {fileID: 2800000, guid: b6118369ea1eb944aab3c798f539874b, type: 3}
        m_Scale: {x: 1, y: 1}
        m_Offset: {x: 0, y: 0}
    m_Ints: []
    m_Floats:
    - Depth: 0.002
    - _AOPower: 1
    - _BumpScale: 1
    - _Cutoff: 0.5
    - _Depth: 1
    - _DetailNormalMapScale: 1
    - _Diffusepower: 1
    - _DstBlend: 0
    - _GlossMapScale: 0.581
    - _Glossiness: 0.5
    - _GlossyReflections: 1
    - _HgtMapSmooth: 3.38
    - _IBLPower: 2
    - _LightWrap: 0
    - _LightWrapPower: 2
    - _Metallic: 0
    - _Mode: 0
    - _NormalSmooth: 0
    - _OcclusionStrenght: 1
    - _OcclusionStrength: 1
    - _Offset: -0.36
    - _Parallax: 0.0065
    - _Quality: 50
    - _RimFresnel: 3
    - _RimPower: 1
    - _Shininess: 0.5
    - _SmoothnessTextureChannel: 0
    - _SpecularHighlights: 1
    - _SpecularIBL: 0
    - _SpecularPower: 1
    - _SrcBlend: 1
    - _Tessellation: 20
    - _UVMasterTiling: 1
    - _UVSec: 0
    - _ZWrite: 1
    m_Colors:
    - _Color: {r: 0.64705884, g: 0.64705884, b: 0.64705884, a: 1}
    - _EmissionColor: {r: 0, g: 0, b: 0, a: 1}
    - _LightWrapColor: {r: 0.5, g: 0.5, b: 0.5, a: 1}
    - _RimLightColor: {r: 0.51470584, g: 0.51470584, b: 0.51470584, a: 1}
    - _SpecColor: {r: 0.5, g: 0.5, b: 0.5, a: 1}
  m_BuildTextureStacks: []
