%YAML 1.1
%TAG !u! tag:unity3d.com,2011:
--- !u!21 &2100000
Material:
  serializedVersion: 8
  m_ObjectHideFlags: 0
  m_CorrespondingSourceObject: {fileID: 0}
  m_PrefabInstance: {fileID: 0}
  m_PrefabAsset: {fileID: 0}
  m_Name: Fresh Planet
  m_Shader: {fileID: 4800000, guid: 01eab4087a959ef4cbc34b8a3fba1e1f, type: 3}
  m_ValidKeywords: []
  m_InvalidKeywords: []
  m_LightmapFlags: 4
  m_EnableInstancingVariants: 0
  m_DoubleSidedGI: 0
  m_CustomRenderQueue: -1
  stringTagMap: {}
  disabledShaderPasses: []
  m_SavedProperties:
    serializedVersion: 3
    m_TexEnvs:
    - _BumpMap:
        m_Texture: {fileID: 0}
        m_Scale: {x: 1, y: 1}
        m_Offset: {x: 0, y: 0}
    - _DetailAlbedoMap:
        m_Texture: {fileID: 0}
        m_Scale: {x: 1, y: 1}
        m_Offset: {x: 0, y: 0}
    - _DetailMask:
        m_Texture: {fileID: 0}
        m_Scale: {x: 1, y: 1}
        m_Offset: {x: 0, y: 0}
    - _DetailNormalMap:
        m_Texture: {fileID: 0}
        m_Scale: {x: 1, y: 1}
        m_Offset: {x: 0, y: 0}
    - _EmissionMap:
        m_Texture: {fileID: 0}
        m_Scale: {x: 1, y: 1}
        m_Offset: {x: 0, y: 0}
    - _MainTex:
        m_Texture: {fileID: 0}
        m_Scale: {x: 1, y: 1}
        m_Offset: {x: 0, y: 0}
    - _MetallicGlossMap:
        m_Texture: {fileID: 0}
        m_Scale: {x: 1, y: 1}
        m_Offset: {x: 0, y: 0}
    - _OcclusionMap:
        m_Texture: {fileID: 0}
        m_Scale: {x: 1, y: 1}
        m_Offset: {x: 0, y: 0}
    - _ParallaxMap:
        m_Texture: {fileID: 0}
        m_Scale: {x: 1, y: 1}
        m_Offset: {x: 0, y: 0}
    - _WindDistortionMap:
        m_Texture: {fileID: 2800000, guid: f28bba76fb944bc48be841e3ab6c411f, type: 3}
        m_Scale: {x: 0.07, y: 1}
        m_Offset: {x: 1.03, y: -17.45}
    m_Ints: []
    m_Floats:
    - _AmbientStrength: 0.5
    - _BendRotationRandom: 0
    - _BladeCurve: 4
    - _BladeForward: 0.66
    - _BladeHeight: 0.26
    - _BladeHeightRandom: 0
    - _BladeRandomAmount: 0.5
    - _BladeSegments: 3
    - _BladeWidth: 0.03
    - _BladeWidthRandom: 0
    - _BumpScale: 1
    - _CutRadius: 1.78
    - _Cutoff: 0.5
    - _DetailNormalMapScale: 1
    - _DstBlend: 0
    - _GlossMapScale: 1
    - _Glossiness: 0.5
    - _GlossyReflections: 1
    - _GrassHeight: 1
    - _GrassWidth: 0.06
    - _MaxDist: 60
    - _Metallic: 0
    - _MinDist: 40
    - _Mode: 0
    - _OcclusionStrength: 1
    - _Parallax: 0.02
    - _Rad: 0.6
    - _Radius: 1.6
    - _RandomHeight: 0.25
    - _Rotation: 0
    - _RotationRandom: 0.174
    - _SmoothnessTextureChannel: 0
    - _SpecularHighlights: 1
    - _SphereRadius: 0.82
    - _SrcBlend: 1
    - _Strength: 0.6
    - _TessellationUniform: 6.7
    - _TranslucentGain: 0.809
    - _UVSec: 0
    - _WindScale: 1
    - _WindSpeed: 100
    - _WindStrength: 1
    - _ZWrite: 1
    m_Colors:
    - _BottomColor: {r: 0, g: 0, b: 0, a: 1}
    - _Color: {r: 0, g: 0.5754717, b: 0.06694827, a: 1}
    - _EmissionColor: {r: 0, g: 0, b: 0, a: 1}
    - _TopColor: {r: 0.3962264, g: 0.3962264, b: 0.3962264, a: 1}
    - _WindFrequency: {r: 0.02, g: 0.002, b: 0, a: 0}
  m_BuildTextureStacks: []
