%YAML 1.1
%TAG !u! tag:unity3d.com,2011:
--- !u!114 &11400000
MonoBehaviour:
  m_ObjectHideFlags: 0
  m_CorrespondingSourceObject: {fileID: 0}
  m_PrefabInstance: {fileID: 0}
  m_PrefabAsset: {fileID: 0}
  m_GameObject: {fileID: 0}
  m_Enabled: 1
  m_EditorHideFlags: 0
  m_Script: {fileID: 11500000, guid: fd12ab62a49904144b40537a22714467, type: 3}
  m_Name: GameConfig
  m_EditorClassIdentifier: 
  PlayerSettings:
    gravityStrength: -16
    gravityScale: 1.3
    fallGravityMult: 2
    maxFallSpeed: 25
    fastFallGravityMult: 3.5
    maxFastFallSpeed: 30
    runMaxSpeed: 11
    runAcceleration: 2.5
    runAccelAmount: 11.363636
    runDecceleration: 2
    runDeccelAmount: 9.090909
    accelInAir: 0.65
    deccelInAir: 0.65
    doConserveMomentum: 1
    jumpHeight: 2
    jumpTimeToApex: 0.5
    jumpForce: 8
    playerSize: {x: 1, y: 0.2, z: 1}
    GroundLayerMask:
      serializedVersion: 2
      m_Bits: 64
    maxDistance: 0.55
    jumpCutGravityMult: 2
    jumpHangGravityMult: 0.5
    jumpHangTimeThreshold: 1
    jumpHangAccelerationMult: 1.1
    jumpHangMaxSpeedMult: 1.3
    WaterForce: 15
    WaterForceMaxXSpeed: 5
    coyoteTime: 0.1
    jumpInputBufferTime: 0.1
