﻿id,name,model_id:id,group_id:id,perm_read,perm_write,perm_create,perm_unlink
access_marketing_communication_campaign,marketing_communication.campaign,model_marketing_communication_campaign,group_marketing_communication_user,1,1,1,1
access_marketing_communication_activity,marketing_communication.activity,model_marketing_communication_activity,group_marketing_communication_user,1,1,1,1

