[
  {
    "user": "5e46dca03cd8ca13208dcddc",
    "title": "คณิตศาสตร์ประถมุก",
    "description": "โจทย์คำถามคณิตศาสตร์ในระดับประถมศึกษา ที่ใครๆก็สามารถทำได้ก็สามารถทำได้",
    "image": "https://www.wellesley.edu/sites/default/files/styles/news_0_image/public/assets/dailyshot/ds_461390782.jpg?itok=XlD1NdXi",
    "types": [
      "Math"
    ],
    "rating": 4.3,
    "fullScore": 40,
    "userScoreList": [
      {
        "user": "5e46e2f420b5ac04d477a15a",
        "score": 40
      }
    ],
    "questions": [
      {
        "title": "จงหาผลบวกของเลข 3 หลักทั้งหมดที่สร้างจากเลขโดด 1, 5 และ 7 มีค่าตรงกับข้อใด?",
        "image": null,
        "score": 10,
        "answers": [
          {
            "value": 2849,
            "isCorrectAnswer": false
          },
          {
            "value": 2867,
            "isCorrectAnswer": false
          },
          {
            "value": 2886,
            "isCorrectAnswer": true
          },
          {
            "value": 2904,
            "isCorrectAnswer": false
          }
        ]
      },
      {
        "title": "ค่าของ arccos(sin(17π / 7)) - arcsin(sin(10π / 7)) เท่ากับข้อใด?",
        "image": null,
        "score": 30,
        "answers": [
          {
            "value": "-5π / 14",
            "isCorrectAnswer": false
          },
          {
            "value": "π / 14",
            "isCorrectAnswer": false
          },
          {
            "value": "2π / 7",
            "isCorrectAnswer": false
          },
          {
            "value": "π / 2",
            "isCorrectAnswer": true
          }
        ]
      }
    ]
  },
  {
    "user": "5e479035cac51414383be5e7",
    "title": "วิทยาศาสตร์แสนสนุก",
    "description": "โจทย์คำถามในหมวดวิทศาสตร์ตั้งแต่ระดับประถมถึงระดับมหา'ลัย ที่ใครๆก็สามารถทำได้",
    "image": "https://dpb.carnegiescience.edu/sites/dpb/files/public-engagement-science-comms-hero_0.jpg",
    "types": [
      "Chemistry",
      "Physics",
      "Biology"
    ],
    "rating": 2.1,
    "fullScore": 45,
    "userScoreList": [
      {
        "user": "5e46e2f420b5ac04d477a15a",
        "score": 40
      },
      {
        "user": "5e46dca03cd8ca13208dcddc",
        "score": 35
      }
    ],
    "questions": [
      {
        "title": "ธาตุหมู่ใดในตารางธาตุทำปฏิกิริยาอย่างรุนแรงกับน้ำ?",
        "image": null,
        "score": 20,
        "answers": [
          {
            "value": "หมู่ 1 (Li, Na, K, Rb, Cs, and Fr)",
            "isCorrectAnswer": true
          },
          {
            "value": "หมู่ 2 (Be, Mg, Ca, Sr, Ba, and Ra)",
            "isCorrectAnswer": false
          },
          {
            "value": "หมู่ 5 (N, P, As, Sb, Bi, and Mc)",
            "isCorrectAnswer": false
          },
          {
            "value": "หมู่ 8 (He, Ne, Ar, Kr, Xe, Rn and Og)",
            "isCorrectAnswer": false
          }
        ]
      },
      {
        "title": "ปลิง (Leech) อยู่ในอาณาจักรใด?",
        "image": null,
        "score": 10,
        "answers": [
          {
            "value": "อาณาจักรมอเนอรา (Kingdom Monera)",
            "isCorrectAnswer": true
          },
          {
            "value": "อาณาจักรโปรติสตา (PROTISTA KINGDOM)",
            "isCorrectAnswer": false
          },
          {
            "value": "อาณาจักรพืช (PLANT KINGDOM)",
            "isCorrectAnswer": false
          },
          {
            "value": "อาณาจักรสัตว์ (KINGDOM ANIMALIA)",
            "isCorrectAnswer": false
          }
        ]
      },
      {
        "title": "ศักย์ไฟฟ้าที่จุด A สูงกว่าศักย์ไฟฟ้าที่จุด B อยู่กี่โวลต์?",
        "image": "https://i.imgur.com/47DpfYA.png",
        "score": 10,
        "answers": [
          {
            "value": 1,
            "isCorrectAnswer": false
          },
          {
            "value": "(R - r) / (R + r)",
            "isCorrectAnswer": true
          },
          {
            "value": "R / (R + r)",
            "isCorrectAnswer": false
          },
          {
            "value": "r / (R + r)",
            "isCorrectAnswer": false
          }
        ]
      }
    ]
  }
]