[
  {
    "id": 1,
    "username": "zebra99",
    "password": "123456789",
    "firstName": "Bryana",
    "lastName": "White",
    "image": "https://s3.amazonaws.com/uifaces/faces/twitter/VMilescu/128.jpg",
    "history": [{ "quizId": 1, "score": 3 }]
  },
  {
    "id": 2,
    "username": "pinkboy78",
    "password": "987654321",
    "firstName": "Ofelia",
    "lastName": "Will",
    "image": "https://s3.amazonaws.com/uifaces/faces/twitter/kaelifa/128.jpg",
    "history": []
  },
  {
    "id": 3,
    "username": "sunshine666",
    "password": "letmein",
    "firstName": "Lindsay",
    "lastName": "Weber",
    "image": "https://s3.amazonaws.com/uifaces/faces/twitter/syropian/128.jpg",
    "history": []
  }
]
