{
	"info": {
		"_postman_id": "59d4cf4f-8503-445a-b553-fd6f4de125c6",
		"name": "Movie",
		"schema": "https://schema.getpostman.com/json/collection/v2.1.0/collection.json"
	},
	"item": [
		{
			"name": "Add Movie",
			"request": {
				"method": "POST",
				"header": [],
				"body": {
					"mode": "raw",
					"raw": "{\r\n   \"movie_title\" : \"Roy\",\r\n   \"movie_release_date\": \"2019/02/15\",\r\n   \"movie_time\" : 13.15,\r\n   \"director_name\": \"Sujit\"\r\n}",
					"options": {
						"raw": {
							"language": "json"
						}
					}
				},
				"url": {
					"raw": "http://localhost:4000/movie/",
					"protocol": "http",
					"host": [
						"localhost"
					],
					"port": "4000",
					"path": [
						"movie",
						""
					]
				}
			},
			"response": []
		},
		{
			"name": "Display Movie",
			"request": {
				"method": "GET",
				"header": [],
				"url": null
			},
			"response": []
		},
		{
			"name": "Update",
			"request": {
				"method": "PUT",
				"header": [],
				"body": {
					"mode": "raw",
					"raw": "{\r\n    \"movie_release_date\" : \"2019/2/15\",\r\n    \"movie_time\" : \"14.02\"\r\n}",
					"options": {
						"raw": {
							"language": "json"
						}
					}
				},
				"url": {
					"raw": "http://localhost:4000/movie/1",
					"protocol": "http",
					"host": [
						"localhost"
					],
					"port": "4000",
					"path": [
						"movie",
						"1"
					]
				}
			},
			"response": []
		},
		{
			"name": "delete Movie",
			"request": {
				"method": "GET",
				"header": [],
				"url": null
			},
			"response": []
		}
	]
}