{
	"dates": {
		"creationDate": {
			"formatString": "",
			"dateString": "$dd | $mm | $yyyy"
		}
	},
	"general": {
		"displayText": true
	},
	"places": {
		"userPopout": true,
		"userProfile": true
	}
}