{
    "currentVersionInfo": {
        "version": "0.0.5",
        "hasShownChangelog": true
    },
    "settings": {
        "showInMemberList": true,
        "showOnMessages": true,
        "showInDmsList": true,
        "showOnTags": true,
        "ignoreBots": true,
        "icons": {
            "web": true,
            "desktop": true,
            "mobile": true
        }
    }
}