module gitlab.com/500chains/phi/chain

go 1.14

require (
	github.com/btcsuite/btcd v0.0.0-20190807005414-4063feeff79a // indirect
	github.com/cosmos/cosmos-sdk v0.38.2
	github.com/golang/mock v1.3.1 // indirect
	github.com/onsi/ginkgo v1.8.0 // indirect
	github.com/onsi/gomega v1.5.0 // indirect
	github.com/rcrowley/go-metrics v0.0.0-20190706150252-9beb055b7962 // indirect
	github.com/spf13/afero v1.2.2 // indirect
	github.com/spf13/cobra v0.0.6
	github.com/spf13/viper v1.6.2
	github.com/stretchr/testify v1.5.1
	github.com/tendermint/go-amino v0.15.1
	github.com/tendermint/tendermint v0.33.2
	github.com/tendermint/tm-db v0.5.0
	golang.org/x/net v0.0.0-20190827160401-ba9fcec4b297 // indirect
)
