{
  "data": {
    "document": {
      "name": null,
      "filename": "document.pdf",
      "file_size": "26451",
      "created_at": "2020-11-17T15:59:46+0100",
      "updated_at": "2020-11-17T15:59:46+0100"
    },
    "sign_request": {
      "key": "kYNtRHBaoB2VLiL34au0Hh8RWbeoLbUW7HdAXsfdldJnQh9epH",
      "sent": 1,
      "sent_at": "2020-11-17T15:59:49+0100",
      "all_signed": 0,
      "all_signed_at": "0000-00-00 00:00:00",
      "signed_hash": null,
      "proof_hash": null,
      "canceled": 0,
      "canceled_at": "0000-00-00 00:00:00",
      "message": "",
      "comment": null,
      "external_key": null,
      "call_back_url": null,
      "created_at": "2020-11-17T15:59:46+0100",
      "updated_at": "2020-11-17T15:59:49+0100",
      "terms": [
        {
          "term_code": "1w",
          "term_expired": 0,
          "term_expires": "2020-11-24T15:59:49+0100",
          "created_at": "2020-11-17T15:59:46+0100"
        }
      ],
      "signers": [
        {
          "key": "nMlT7NWokcQATAEIEDSrwKVKx6oX8jtnIOQrrZrT33ZGk6nVwC",
          "email": "someone@somedomain.nl",
          "name": null,
          "order": null,
          "phone": null,
          "auth_method": null,
          "created_at": "2020-11-17T15:59:47+0100",
          "updated_at": "2020-11-17T15:59:48+0100",
          "sign_url": "https:\/\/local.stiply.nl\/viewer\/RaHD3jpTsF92MraLIXJvPcvPAGvDKtX5gO46tJw3VKM1ufSind\/G4AIdU6r0SWL9QyTZ0J3JTmaKVUGBFoZ7282vA8KeLnrHD9K1o",
          "signer_progresses": []
        }
      ]
    }
  }
}