/home/gilberto/4catsdev/SOAP-based web service/GitLab/jax-ws-crud-service/src/main/java/com/fourcatsdev/jaxwscrudservice/servico/NoticiaSEI.java
/home/gilberto/4catsdev/SOAP-based web service/GitLab/jax-ws-crud-service/src/main/java/com/fourcatsdev/jaxwscrudservice/dao/NoticiaDao.java
/home/gilberto/4catsdev/SOAP-based web service/GitLab/jax-ws-crud-service/src/main/java/com/fourcatsdev/jaxwscrudservice/modelo/Noticia.java
/home/gilberto/4catsdev/SOAP-based web service/GitLab/jax-ws-crud-service/src/main/java/com/fourcatsdev/jaxwscrudservice/util/Conexao.java
/home/gilberto/4catsdev/SOAP-based web service/GitLab/jax-ws-crud-service/src/main/java/com/fourcatsdev/jaxwscrudservice/servico/NoticiaSIB.java
/home/gilberto/4catsdev/SOAP-based web service/GitLab/jax-ws-crud-service/src/main/java/com/fourcatsdev/jaxwscrudservice/App.java
/home/gilberto/4catsdev/SOAP-based web service/GitLab/jax-ws-crud-service/src/main/java/com/fourcatsdev/jaxwscrudservice/dao/NoticiaImpl.java
