main.c:70:10:ledperiodtask	24	static,ignoring_inline_asm
main.c:87:5:main	64	static
main.c:173:6:SystemClock_Config	88	static
main.c:218:13:MX_USART2_UART_Init	8	static
main.c:251:13:MX_GPIO_Init	40	static
main.c:283:6:StartDefaultTask	16	static
main.c:302:6:HAL_TIM_PeriodElapsedCallback	16	static
main.c:319:6:Error_Handler	4	static,ignoring_inline_asm
