18:15:37 **** Incremental Build of configuration Debug for project lab_exam ****
make -j4 all 
arm-none-eabi-gcc "../Core/Src/main.c" -mcpu=cortex-m4 -std=gnu11 -g3 -DDEBUG -DUSE_HAL_DRIVER -DSTM32F407xx -c -I../Core/Inc -I../Drivers/STM32F4xx_HAL_Driver/Inc -I../Drivers/STM32F4xx_HAL_Driver/Inc/Legacy -I../Drivers/CMSIS/Device/ST/STM32F4xx/Include -I../Drivers/CMSIS/Include -I../Middlewares/Third_Party/FreeRTOS/Source/include -I../Middlewares/Third_Party/FreeRTOS/Source/CMSIS_RTOS -I../Middlewares/Third_Party/FreeRTOS/Source/portable/GCC/ARM_CM4F -O0 -ffunction-sections -fdata-sections -Wall -fstack-usage -MMD -MP -MF"Core/Src/main.d" -MT"Core/Src/main.o" --specs=nano.specs -mfpu=fpv4-sp-d16 -mfloat-abi=hard -mthumb -o "Core/Src/main.o"
arm-none-eabi-gcc -o "lab_exam.elf" @"objects.list"   -mcpu=cortex-m4 -T"D:\LAB_EXAMS\rtos_lab_exam\rtos_lab_exam\lab_exam\STM32F407VGTX_FLASH.ld" --specs=nosys.specs -Wl,-Map="lab_exam.map" -Wl,--gc-sections -static --specs=nano.specs -mfpu=fpv4-sp-d16 -mfloat-abi=hard -mthumb -Wl,--start-group -lc -lm -Wl,--end-group
Finished building target: lab_exam.elf
 
arm-none-eabi-objdump -h -S  lab_exam.elf  > "lab_exam.list"
arm-none-eabi-objcopy  -O binary  lab_exam.elf  "lab_exam.bin"
arm-none-eabi-size   lab_exam.elf 
   text	   data	    bss	    dec	    hex	filename
  15468	     24	  18008	  33500	   82dc	lab_exam.elf
Finished building: default.size.stdout
 
Finished building: lab_exam.bin
 
Finished building: lab_exam.list
 
18:16:11 **** Incremental Build of configuration Debug for project lab_exam ****
make -j4 all 
arm-none-eabi-size   lab_exam.elf 
   text	   data	    bss	    dec	    hex	filename
  15468	     24	  18008	  33500	   82dc	lab_exam.elf
Finished building: default.size.stdout
 
18:25:43 **** Incremental Build of configuration Debug for project lab_exam ****
make -j4 all 
arm-none-eabi-size   lab_exam.elf 
   text	   data	    bss	    dec	    hex	filename
  15468	     24	  18008	  33500	   82dc	lab_exam.elf
Finished building: default.size.stdout
 
18:25:47 **** Incremental Build of configuration Debug for project lab_exam ****
make -j4 all 
arm-none-eabi-size   lab_exam.elf 
   text	   data	    bss	    dec	    hex	filename
  15468	     24	  18008	  33500	   82dc	lab_exam.elf
Finished building: default.size.stdout
 
18:30:42 **** Incremental Build of configuration Debug for project lab_exam ****
make -j4 all 
arm-none-eabi-gcc "../Core/Src/main.c" -mcpu=cortex-m4 -std=gnu11 -g3 -DDEBUG -DUSE_HAL_DRIVER -DSTM32F407xx -c -I../Core/Inc -I../Drivers/STM32F4xx_HAL_Driver/Inc -I../Drivers/STM32F4xx_HAL_Driver/Inc/Legacy -I../Drivers/CMSIS/Device/ST/STM32F4xx/Include -I../Drivers/CMSIS/Include -I../Middlewares/Third_Party/FreeRTOS/Source/include -I../Middlewares/Third_Party/FreeRTOS/Source/CMSIS_RTOS -I../Middlewares/Third_Party/FreeRTOS/Source/portable/GCC/ARM_CM4F -O0 -ffunction-sections -fdata-sections -Wall -fstack-usage -MMD -MP -MF"Core/Src/main.d" -MT"Core/Src/main.o" --specs=nano.specs -mfpu=fpv4-sp-d16 -mfloat-abi=hard -mthumb -o "Core/Src/main.o"
../Core/Src/main.c: In function 'ledperiodtask':
../Core/Src/main.c:75:10: error: 'i' undeclared (first use in this function)
   75 |       if(i%5==0)
      |          ^
../Core/Src/main.c:75:10: note: each undeclared identifier is reported only once for each function it appears in
In file included from f:\stm32\st\stm32cubeide_1.6.1\stm32cubeide\plugins\com.st.stm32cube.ide.mcu.externaltools.gnu-tools-for-stm32.9-2020-q2-update.win32_1.5.0.202011040924\tools\arm-none-eabi\include\string.h:17,
                 from ../Core/Src/main.c:26:
../Core/Src/main.c: At top level:
../Core/Src/main.c:78:18: error: expected declaration specifiers or '...' before '(' token
   78 |      vTaskDelete(NULL);
      |                  ^~~~
../Core/Src/main.c:80:5: error: expected identifier or '(' before '}' token
   80 |     }
      |     ^
make: *** [Core/Src/subdir.mk:42: Core/Src/main.o] Error 1
"make -j4 all" terminated with exit code 2. Build might be incomplete.
18:30:58 **** Incremental Build of configuration Debug for project lab_exam ****
make -j4 all 
arm-none-eabi-gcc "../Core/Src/main.c" -mcpu=cortex-m4 -std=gnu11 -g3 -DDEBUG -DUSE_HAL_DRIVER -DSTM32F407xx -c -I../Core/Inc -I../Drivers/STM32F4xx_HAL_Driver/Inc -I../Drivers/STM32F4xx_HAL_Driver/Inc/Legacy -I../Drivers/CMSIS/Device/ST/STM32F4xx/Include -I../Drivers/CMSIS/Include -I../Middlewares/Third_Party/FreeRTOS/Source/include -I../Middlewares/Third_Party/FreeRTOS/Source/CMSIS_RTOS -I../Middlewares/Third_Party/FreeRTOS/Source/portable/GCC/ARM_CM4F -O0 -ffunction-sections -fdata-sections -Wall -fstack-usage -MMD -MP -MF"Core/Src/main.d" -MT"Core/Src/main.o" --specs=nano.specs -mfpu=fpv4-sp-d16 -mfloat-abi=hard -mthumb -o "Core/Src/main.o"
../Core/Src/main.c: In function 'ledperiodtask':
../Core/Src/main.c:75:10: error: 'i' undeclared (first use in this function)
   75 |       if(i%5==0)
      |          ^
../Core/Src/main.c:75:10: note: each undeclared identifier is reported only once for each function it appears in
make: *** [Core/Src/subdir.mk:42: Core/Src/main.o] Error 1
"make -j4 all" terminated with exit code 2. Build might be incomplete.
18:31:23 **** Incremental Build of configuration Debug for project lab_exam ****
make -j4 all 
arm-none-eabi-gcc "../Core/Src/main.c" -mcpu=cortex-m4 -std=gnu11 -g3 -DDEBUG -DUSE_HAL_DRIVER -DSTM32F407xx -c -I../Core/Inc -I../Drivers/STM32F4xx_HAL_Driver/Inc -I../Drivers/STM32F4xx_HAL_Driver/Inc/Legacy -I../Drivers/CMSIS/Device/ST/STM32F4xx/Include -I../Drivers/CMSIS/Include -I../Middlewares/Third_Party/FreeRTOS/Source/include -I../Middlewares/Third_Party/FreeRTOS/Source/CMSIS_RTOS -I../Middlewares/Third_Party/FreeRTOS/Source/portable/GCC/ARM_CM4F -O0 -ffunction-sections -fdata-sections -Wall -fstack-usage -MMD -MP -MF"Core/Src/main.d" -MT"Core/Src/main.o" --specs=nano.specs -mfpu=fpv4-sp-d16 -mfloat-abi=hard -mthumb -o "Core/Src/main.o"
../Core/Src/main.c: In function 'ledperiodtask':
../Core/Src/main.c:77:11: warning: 'i' is used uninitialized in this function [-Wuninitialized]
   77 |       if(i%5==0)
      |          ~^~
arm-none-eabi-gcc -o "lab_exam.elf" @"objects.list"   -mcpu=cortex-m4 -T"D:\LAB_EXAMS\rtos_lab_exam\rtos_lab_exam\lab_exam\STM32F407VGTX_FLASH.ld" --specs=nosys.specs -Wl,-Map="lab_exam.map" -Wl,--gc-sections -static --specs=nano.specs -mfpu=fpv4-sp-d16 -mfloat-abi=hard -mthumb -Wl,--start-group -lc -lm -Wl,--end-group
Finished building target: lab_exam.elf
 
arm-none-eabi-objdump -h -S  lab_exam.elf  > "lab_exam.list"
arm-none-eabi-objcopy  -O binary  lab_exam.elf  "lab_exam.bin"
arm-none-eabi-size   lab_exam.elf 
   text	   data	    bss	    dec	    hex	filename
  15532	     24	  18008	  33564	   831c	lab_exam.elf
Finished building: default.size.stdout
 
Finished building: lab_exam.bin
 
Finished building: lab_exam.list
 
18:32:19 **** Incremental Build of configuration Debug for project lab_exam ****
make -j4 all 
arm-none-eabi-gcc "../Core/Src/main.c" -mcpu=cortex-m4 -std=gnu11 -g3 -DDEBUG -DUSE_HAL_DRIVER -DSTM32F407xx -c -I../Core/Inc -I../Drivers/STM32F4xx_HAL_Driver/Inc -I../Drivers/STM32F4xx_HAL_Driver/Inc/Legacy -I../Drivers/CMSIS/Device/ST/STM32F4xx/Include -I../Drivers/CMSIS/Include -I../Middlewares/Third_Party/FreeRTOS/Source/include -I../Middlewares/Third_Party/FreeRTOS/Source/CMSIS_RTOS -I../Middlewares/Third_Party/FreeRTOS/Source/portable/GCC/ARM_CM4F -O0 -ffunction-sections -fdata-sections -Wall -fstack-usage -MMD -MP -MF"Core/Src/main.d" -MT"Core/Src/main.o" --specs=nano.specs -mfpu=fpv4-sp-d16 -mfloat-abi=hard -mthumb -o "Core/Src/main.o"
../Core/Src/main.c: In function 'ledperiodtask':
../Core/Src/main.c:71:10: warning: unused variable 'i' [-Wunused-variable]
   71 |      int i;
      |          ^
arm-none-eabi-gcc -o "lab_exam.elf" @"objects.list"   -mcpu=cortex-m4 -T"D:\LAB_EXAMS\rtos_lab_exam\rtos_lab_exam\lab_exam\STM32F407VGTX_FLASH.ld" --specs=nosys.specs -Wl,-Map="lab_exam.map" -Wl,--gc-sections -static --specs=nano.specs -mfpu=fpv4-sp-d16 -mfloat-abi=hard -mthumb -Wl,--start-group -lc -lm -Wl,--end-group
Finished building target: lab_exam.elf
 
arm-none-eabi-objdump -h -S  lab_exam.elf  > "lab_exam.list"
arm-none-eabi-objcopy  -O binary  lab_exam.elf  "lab_exam.bin"
arm-none-eabi-size   lab_exam.elf 
   text	   data	    bss	    dec	    hex	filename
  15500	     24	  18008	  33532	   82fc	lab_exam.elf
Finished building: default.size.stdout
 
Finished building: lab_exam.bin
 
Finished building: lab_exam.list
 
18:32:27 **** Incremental Build of configuration Debug for project lab_exam ****
make -j4 all 
arm-none-eabi-gcc "../Core/Src/main.c" -mcpu=cortex-m4 -std=gnu11 -g3 -DDEBUG -DUSE_HAL_DRIVER -DSTM32F407xx -c -I../Core/Inc -I../Drivers/STM32F4xx_HAL_Driver/Inc -I../Drivers/STM32F4xx_HAL_Driver/Inc/Legacy -I../Drivers/CMSIS/Device/ST/STM32F4xx/Include -I../Drivers/CMSIS/Include -I../Middlewares/Third_Party/FreeRTOS/Source/include -I../Middlewares/Third_Party/FreeRTOS/Source/CMSIS_RTOS -I../Middlewares/Third_Party/FreeRTOS/Source/portable/GCC/ARM_CM4F -O0 -ffunction-sections -fdata-sections -Wall -fstack-usage -MMD -MP -MF"Core/Src/main.d" -MT"Core/Src/main.o" --specs=nano.specs -mfpu=fpv4-sp-d16 -mfloat-abi=hard -mthumb -o "Core/Src/main.o"
arm-none-eabi-gcc -o "lab_exam.elf" @"objects.list"   -mcpu=cortex-m4 -T"D:\LAB_EXAMS\rtos_lab_exam\rtos_lab_exam\lab_exam\STM32F407VGTX_FLASH.ld" --specs=nosys.specs -Wl,-Map="lab_exam.map" -Wl,--gc-sections -static --specs=nano.specs -mfpu=fpv4-sp-d16 -mfloat-abi=hard -mthumb -Wl,--start-group -lc -lm -Wl,--end-group
Finished building target: lab_exam.elf
 
arm-none-eabi-objdump -h -S  lab_exam.elf  > "lab_exam.list"
arm-none-eabi-objcopy  -O binary  lab_exam.elf  "lab_exam.bin"
arm-none-eabi-size   lab_exam.elf 
   text	   data	    bss	    dec	    hex	filename
  15500	     24	  18008	  33532	   82fc	lab_exam.elf
Finished building: default.size.stdout
 
Finished building: lab_exam.bin
 
Finished building: lab_exam.list
 
18:33:24 **** Incremental Build of configuration Debug for project lab_exam ****
make -j4 all 
arm-none-eabi-size   lab_exam.elf 
   text	   data	    bss	    dec	    hex	filename
  15500	     24	  18008	  33532	   82fc	lab_exam.elf
Finished building: default.size.stdout
 
