<svg width="900" height="900" viewBox="0 0 900 900" fill="none" xmlns="http://www.w3.org/2000/svg">
<g clip-path="url(#clip0_2092_24667)">
<path d="M225 225.007H0V450.007H225V225.007Z" fill="white"/>
<path d="M450 674.989C342.58 675.689 225.96 566.594 225 449.998H0C1.62 699.968 219.68 902.08 450 899.98V674.989Z" fill="#1D4ED8"/>
<path d="M450 0.0162164H225V449.998H450V225.007C557.42 224.307 674.04 333.403 675 449.998V900H900V449.998C898.38 200.028 680.32 -2.0837 450 0.0162164Z" fill="#1D4ED8"/>
</g>
<defs>
<clipPath id="clip0_2092_24667">
<rect width="900" height="900" fill="white"/>
</clipPath>
</defs>
</svg>
