<svg width="128" height="128" xmlns="http://www.w3.org/2000/svg">

  <circle class="back" cx="64" cy="64" r="48" fill="#F55"/>
  <path fill="none" stroke="#FFF" stroke-width="7" stroke-linecap="round" stroke-linejoin="round" d="
    M42,88 L28,64 L42,40
    M86,88 L98,64 L86,40
    M56,90        L72,38
    "/>

</svg>
