{
  "build": {
    "arch": "arm",
    "cpu": "cortex-m0",
    "family": "stm32",
    "mcu": "stm32f072rb",
    "extra_flags": "-DSTM32F072xB",
    "f_cpu": "48000000L"
  },
  "frameworks": ["framework-remix"],
  "debug": {
    "default_tools": [
      "stlink"
    ],
    "jlink_device": "STM32F072RB",
    "onboard_tools": [
      "stlink"
    ],
    "openocd_board": "st_nucleo_f0",
    "openocd_target": "stm32f0x",
    "svd_path": "STM32F072x.svd"
  },
  "name": "ST Nucleo F072RB",
  "id": "nucleo_f072rb",
  "upload": {
    "maximum_ram_size": 16384,
    "maximum_size": 131072,
    "protocol": "stlink",
    "protocols": [
      "jlink",
      "stlink"
    ]
  },
  "url": "https://developer.mbed.org/platforms/ST-Nucleo-F072RB/",
  "vendor": "ST"
}
