{
  "build": {
    "arch": "arm",
    "cpu": "cortex-m3",
    "family": "stm32",
    "mcu": "stm32f103rb",
    "extra_flags": "-DSTM32F103xB",
    "f_cpu": "72000000L"
  },
  "debug": {
    "default_tools": [
      "stlink"
    ],
    "jlink_device": "STM32F103RB",
    "onboard_tools": [
      "stlink"
    ],
    "openocd_board": "st_nucleo_f103rb",
    "openocd_target": "stm32f1x",
    "svd_path": "STM32F103xx.svd"
  },
  "frameworks": [
    "remix"
  ],
  "id": "stm32f103_base",
  "name": "ST Nucleo F103RB",
  "upload": {
    "maximum_ram_size": 20480,
    "maximum_size": 131072,
    "protocol": "stlink",
    "protocols": [
      "jlink",
      "stlink"
    ]
  },
  "url": "https://developer.mbed.org/platforms/ST-Nucleo-F103RB/",
  "vendor": "ST"
}
