{
  "name": "remix",
  "title": "Remix",
  "description": "Experimental platform for different targets",
  "license": "MIT",
  "version": "0.4.3",
  "packages": {
    "toolchain-gccarmnoneeabi": {
      "type": "toolchain",
      "owner": "platformio",
      "version": ">=1.120201.221222",
      "optional": true
    },
    "toolchain-gccavr": {
      "type": "toolchain",
      "version": ">=12.0",
      "optional": true
    },
    "toolchain-gccmsp430": {
      "type": "toolchain",
      "version": ">=13.0",
      "optional": true
    },
    "framework-cmsis": {
      "type": "framework",
      "optional": true
    },
    "framework-cmsis-stm32f0": {
      "type": "framework",
      "optional": true
    },
    "framework-cmsis-stm32f1": {
      "type": "framework",
      "optional": true
    },
    "framework-cmsis-stm32f2": {
      "type": "framework",
      "optional": true
    },
    "framework-cmsis-stm32f3": {
      "type": "framework",
      "optional": true
    },
    "framework-cmsis-stm32f4": {
      "type": "framework",
      "optional": true
    },
    "framework-cmsis-stm32f7": {
      "type": "framework",
      "optional": true
    },
    "framework-cmsis-stm32g0": {
      "type": "framework",
      "optional": true
    },
    "framework-cmsis-stm32g4": {
      "type": "framework",
      "optional": true
    },
    "framework-cmsis-stm32h7": {
      "type": "framework",
      "optional": true
    },
    "framework-cmsis-stm32l0": {
      "type": "framework",
      "optional": true
    },
    "framework-cmsis-stm32l1": {
      "type": "framework",
      "optional": true
    },
    "framework-cmsis-stm32l4": {
      "type": "framework",
      "optional": true
    },
    "framework-cmsis-stm32l5": {
      "type": "framework",
      "optional": true
    },
    "tool-stm32duino": {
      "type": "uploader",
      "optional": true,
      "owner": "platformio",
      "version": "~1.0.1"
    },
    "tool-openocd": {
      "type": "uploader",
      "optional": true,
      "owner": "platformio",
      "version": "~3.1200.0"
    },
    "tool-jlink": {
      "type": "uploader",
      "optional": true,
      "owner": "platformio",
      "version": "^1.63208.0"
    },
    "tool-dfuutil": {
      "type": "uploader",
      "optional": true,
      "owner": "platformio",
      "version": "~1.11.0"
    },
    "tool-avrdude": {
      "type": "uploader",
      "optional": true,
      "owner": "platformio",
      "version": "~1.70200.0"
    }
  }
}
