module gitlab.com/404busters/live-portal/livestream-server

go 1.14

require (
	github.com/coreos/go-oidc v2.2.1+incompatible
	github.com/google/go-cmp v0.4.1 // indirect
	github.com/pquerna/cachecontrol v0.0.0-20180517163645-1555304b9b35 // indirect
	github.com/stretchr/testify v1.6.1 // indirect
	golang.org/x/crypto v0.0.0-20200604202706-70a84ac30bf9 // indirect
	golang.org/x/oauth2 v0.0.0-20200107190931-bf48bf16ab8d // indirect
	gopkg.in/square/go-jose.v2 v2.5.1 // indirect
)
