{
    "uid": "BD_PY_OOP_USRCLS2",
    "TRN_EVL_ID": "IDF",
    "NETWORK": "COMMERCIAL",
    "KSATs": [
        [
            "A0728",
            "3"
        ],
        [
            "A0725",
            "3"
        ],
        [
            "K0031",
            "B"
        ],
        [
            "K0036",
            "A"
        ],
        [
            "K0039",
            "A"
        ]
    ],
    "course": "IDF",
    "module": "Python",
    "topic": "oop",
    "subject": "user_classes_pt2",
    "lecture_time": 60,
    "perf_demo_time": 120,
    "references": [],
    "lesson_objectives": [
        {
            "description": "Describe polymorphism in Python",
            "KSATs": [
                "K0031"
            ],
            "MSBs": []
        },
        {
            "description": "Describe inheritance in Python",
            "KSATs": [
                "K0036"
            ],
            "MSBs": []
        },
        {
            "description": "Describe getter and setter functions in Python",
            "KSATs": [
                "K0039"
            ],
            "MSBs": []
        }
    ],
    "performance_objectives": [
        {
            "description": "Write object-orientated programs",
            "KSATs": [
                "A0725"
            ]
        },
        {
            "description": "Implement object inheritance.",
            "KSATs": [
                "A0728"
            ]
        },
        {
            "description": "Expand class functionality using getter and setter functions.",
            "KSATs": [
                "A0725"
            ]
        },
        {
            "description": "Use class methods to modify instantiated class objects.",
            "KSATs": [
                "A0725"
            ]
        }
    ],
    "workroles": [
        "basic-dev"
    ]
}