{
    "version": "2.0.0",
    "tasks": [{
        "label": "Rebuild Site",
        "command": "mdbook", // Could be any other shell command
        "args": [
            "build", "/home/mdbook/network-programming/mdbook",
            "--dest-dir", "/home/mdbook/build/network-programming",
            ""
        ],
        "type": "shell"
    }]
}