{
    "definitions": {
        "q_id": {
            "$id": "#q_id",
            "type": "object",
            "properties": {
                "_id": {"type": "string"},
                "rel-link_id": {"type": "string", "minLength": 1},
                "question_name": {"type": "string", "minLength": 1},
                "question_path": {"type": "string", "minLength": 1},
                "question_type": {"enum": [ "knowledge", "performance_dev", "performance_non-dev" ]}
            },
            "required": [
                "_id",
                "rel-link_id",
                "question_name",
                "question_path",
                "question_type"
            ]
        },
        "q_metrics": {
            "$id": "#q_metrics",
            "type": "object",
            "properties": {
                "disabled": {"type": "boolean"},
                "provisioned": {"type": "number", "minimum": 0, "multipleOf": 1},
                "attempts": {"type": "number", "minimum": 0, "multipleOf": 1},
                "passes": {"type": "number", "minimum": 0, "multipleOf": 1},
                "failures": {"type": "number", "minimum": 0, "multipleOf": 1}
            },
            "required": [
                "disabled",
                "provisioned",
                "attempts",
                "passes",
                "failures"
            ]
        },
        "sup_files":
        {
            "$id": "#sup_files",
            "type": "array",
            "items": { "type": "string", "minLength": 1},
            "minItems": 0
        },
        "dev_file": {
            "$id": "#dev_file",
            "type": "object",
            "properties": {
                "filepath": {"type": "string", "minLength": 1},
                "headerpath": {"type": "string", "minLength": 1}
            },
            "required": ["filepath"]
        }
    }
}
