<svg width="64.919mm" height="66.675mm" version="1.1" viewBox="0 0 64.919 66.675" xmlns="http://www.w3.org/2000/svg">
 <g transform="translate(-5.5751 -4.526)">
  <g transform="matrix(.26458 0 0 .26458 -2.8977 -14.409)">
   <path d="m154.26 101.65c-42.992-0.2451-82.172 29.712-92.695 72.45-4.0346 16.388-3.9953 31.736 0.3667 48.045 10.789 40.338 47.527 71.424 92.386 71.019 44.997-0.4065 81.47-30.668 92.474-71.197 16.175-59.572-27.866-119.95-92.532-120.32z" fill="#fff" fill-rule="evenodd"/>
   <path d="m56.394 175.3c-3.5609 15.793-3.4784 30.737 0.4506 46.476l-19.466 5.1891c-0.0019-7e-3 -0.0036-0.0151-0.0055-0.0226l-4.8742 1.2661c0.1599 0.6331 0.3243 1.2675 0.4942 1.9028 14.196 53.077 62.536 93.979 121.56 93.446 59.207-0.5346 107.2-40.353 121.68-93.68 0.1316-0.4848 0.2471-0.9698 0.3719-1.4547l-4.8719-1.2656c-1e-3 4e-3 -2e-3 8e-3 -3e-3 0.0119l-19.456-5.1864c4.086-15.952 4.0949-31.926 0.7073-46.871l19.518-5.203c5e-4 2e-3 8e-4 4e-3 1e-3 5e-3l4.8878-1.1861c-12.543-53.878-60.384-96.806-122.91-97.163-56.568-0.3224-108.12 39.096-121.97 95.329-0.1728 0.7023-0.3266 1.2902-0.4882 1.9899 1.7089 0.4154 3.4672 0.8442 5.1452 1.2915l0.1148 0.0262-0.0011 4e-3z" fill="#004090" fill-rule="evenodd"/>
   <g fill="#fff" fill-rule="evenodd">
    <path d="m154.26 101.65c-42.992-0.2451-82.172 29.712-92.695 72.45-4.0346 16.388-3.9952 31.736 0.3667 48.045 10.789 40.338 47.527 71.424 92.386 71.019 44.997-0.4063 81.47-30.668 92.474-71.196 16.174-59.572-27.866-119.95-92.532-120.32z"/>
    <path d="m271.14 165.06c-14.068-50.74-60.455-88.924-116.11-88.924-55.57 0-102.82 38.122-117.16 88.926l19.75 5.3483c12.005-43.587 52.515-73.9 96.886-73.647 48.336 0.2757 85.718 32.405 97.234 73.463z"/>
    <path d="m38.548 231.89 19.636-5.2567c12.352 40.975 50.292 72.139 96.38 71.723 46.09-0.416 83.679-30.591 96.343-71.523l19.54 5.1872c-14.782 49.341-60.264 85.942-115.27 86.229-55.077 0.288-101.56-36.772-116.63-86.36z"/>
   </g>
   <g fill-rule="evenodd">
    <path d="m154.7 101.34a96.226 96.226 0 0 1 96.226 96.225 96.226 96.226 0 1 1-96.226-96.225z"/>
    <path d="m156.21 239.74c23.246 0 42.068-18.87 42.068-42.116 0-23.199-18.823-42.116-42.068-42.116s-42.163 18.917-42.163 42.116c0 23.246 18.917 42.116 42.163 42.116z" fill="#004090"/>
    <path d="m129.34 206.94 5.7408-2.3058 5.1292 0.3765-2.4469-6.3997-2.5411-1.4587-0.5647 2.3998-4.3292-7.529-0.7058-8.1408-1.7411-3.2469 2.6822-6.8232 2.8234 4.3292 4.6586 0.6588 4.0469 4.0939 3.9527-1.3175 2.0705 2.3057 8.0937-4.9409 3.5763 2.4469-3.5763 4.3763 7.3879-0.1412-0.9882 6.2115-2.5881 2.2116-0.9411 4.7057-4.141 4.6115-1.1294 3.5763-0.7999-3.0116-6.0233-1.2235-4.8938 2.7293 0.7058 2.8234 3.0116-0.2353-0.5647 2.6822 1.9294 0.5647 0.7999 1.3646 4.8939 1.8823-1.1294 6.9644-2.8233 3.9527v6.0703l3.5292 5.6468h-1.8823l-5.835-4.8939-4.9409-2.494-3.9528-7.1055-5.9291-3.6234z" fill="#005337"/>
    <path d="m163.98 180.3 5.6939 2.2588 0.5176 7.1996-6.0703 4.8939 0.9411-7.7644z" fill="#566f58"/>
   </g>
   <g fill="#005337" fill-rule="evenodd">
    <path d="m149.56 156.01-5.9152 6.1258-2.8704 0.1412-5.2703 4.6115v1.3176l-4.3763 4.141-4.5986-4.467c0.7661-2.3117 12.565-10.57 23.031-11.87z"/>
    <path d="m171.05 158.31 4.8275 7.6393 0.9882 7.1997 2.5881 0.1411 1.5058-2.0705 2.2117 5.3174-0.7059 5.835 3.0116 3.4351 1.2706-3.4351-0.1883-1.3176 2.3058-1.5058 1.1294 3.2469 2.0041-7.4488c-1.8031-2.4695-3.7878-5.5397-6.338-8.143-2.1486-2.1807-8.0727-6.5857-14.611-8.8937z"/>
    <path d="m176.33 234.65 4.3014-5.5943 5.7409-12.329-1.3176-5.6468-6.0232-0.7529 2.1175-8.5643-0.3764-4.8468 4.8468-10.211 3.2469 2.6822 3.1528-2.1175c0.4733-3.0965 0.9467-6.1929 1.4202-9.2894 2.2685 0.7116 7.7086 19.874 3.2382 32.105-3.6317 8.621-7.4331 17.137-20.348 24.565z"/>
   </g>
   <g fill="none" stroke="#fff" stroke-width=".42">
    <path d="m128.5 165.42s11.063-8.5649 26.493-2.4117c0 0 24.471 5.8692 27.5 38.812 0 0 3.9759 32.612-27.5 37.771"/>
    <path d="m187.58 167.6s-10.428-10.915-32.45-4.0918c0 0-17.787 5.9761-24.61 22.305 0 0-20.234 35.01 13.788 52.092"/>
    <path d="m147 156.44s14.914 0.2386 14.16 36.943c-0.7521 36.656-5.4956 40.105-5.4956 40.105"/>
    <path d="m163.65 156.26s-15.158 3.8603-14.404 40.565c0.7521 36.656 1.412 30.648 6.3554 36.451"/>
    <path d="m126.6 167.53c-3.0516 2.183-3.6047 5.4164-3.6047 9.525 0 11.952 14.87 21.646 33.222 21.646 9.1347 0 46.291-17.052 32.35-28.665"/>
    <path d="m118.31 177.96c-2.2116 3.9998-1.6755 7.995-1.6755 12.56 0 17.693 17.74 32.092 39.622 32.092 21.834 0 39.93-13.16 40.669-32.092-2e-4 -3.8584-0.9098-8.9361-3.4146-12.418"/>
    <path d="m156.92 178.09c8.8466-0.7059 15.623-5.4586 15.246-10.588-0.3765-5.1292-7.9055-8.7525-16.658-8.0467-8.8467 0.7059-15.717 5.4586-15.246 10.588 0.3764 5.1292 7.8113 8.7996 16.658 8.0467z"/>
   </g>
   <g fill="#fff" fill-rule="evenodd">
    <path d="m134.06 161.48 3.9679 4.8596z"/>
    <path d="m155.72 229.92v4.4583z"/>
    <g stroke="#989fa3" stroke-linecap="square">
     <g stroke-width=".2996">
      <path d="m190.08 160.07s2e-3 3.1163 0.1139 3.9392c0.1392 1.0275 1.1771 1.1573 1.0526-0.2787-0.0764-0.8809-0.037-2.8227-0.1622-3.7555-0.1188-0.883-1.1434-0.563-1.0043 0.095z"/>
      <path d="m193.78 156.76s0.0471 3.1658 0.1589 3.989c0.1394 1.0276 1.1771 1.1572 1.0526-0.2788-0.0764-0.8809-0.0664-2.819-0.1622-3.7555-0.1486-0.8789-1.1884-0.6126-1.0493 0.0453z"/>
      <path d="m191.24 159.25s0.0472 3.1658 0.159 3.9889c0.1394 1.0277 1.1771 1.1573 1.0526-0.2787-0.0764-0.8809-0.0665-2.819-0.1622-3.7555-0.1487-0.8789-1.1884-0.6126-1.0494 0.0453z"/>
      <path d="m195.02 155.61s0.0472 3.1657 0.159 3.9889c0.1394 1.0276 1.1771 1.1573 1.0525-0.2788-0.0764-0.8809-0.0664-2.819-0.1622-3.7555-0.1486-0.8788-1.1884-0.6126-1.0493 0.0454z"/>
      <path d="m196.16 154.74s0.0472 3.1657 0.159 3.9889c0.1394 1.0276 1.1771 1.1573 1.0526-0.2787-0.0764-0.881-0.0665-2.8191-0.1622-3.7555-0.1487-0.8789-1.1884-0.6127-1.0494 0.0453z"/>
      <path d="m197.41 157.9c0.0726 1.1126 1.0618 1.1117 1.0075-0.328-0.0385-1.0159-0.2057-1.0041-0.2738-1.1183-0.7137-1.1983-0.7685 0.9132-0.7337 1.4463z"/>
      <path d="m192.41 158s0.0474 3.1658 0.1589 3.989c0.1394 1.0274 1.4232 1.1458 1.2989-0.2901-0.0762-0.8807-0.103-2.8479-0.2282-3.7807-0.1187-0.883-1.3687-0.5761-1.2296 0.0818z"/>
     </g>
     <path d="m188.53 161.62c0.0775 0.5494-0.1749 0.3927-0.0628 1.2708 5e-3 0.0432 0.9171 0.7684 1.3203 1.2487 0.315 0.3751 0.1354-1.9814 0.0432-2.7144-0.0995-0.7899-0.3124-1.0568-0.615-1.042-0.2237 0.011-0.8087 0.3654-0.6857 1.2369z" stroke-width=".282"/>
    </g>
   </g>
   <g fill="#ffd800" fill-rule="evenodd" stroke="#efe6a6" stroke-linecap="square">
    <path d="m188.85 164.53c0.6482 0.6455 3.2813 3.3625 3.4724 4.35 0.1422 1.1198-0.7691 0.332-0.6599 1.0938 0.2513 1.8817 2.2854 1.0554 2.3358-0.5042 0.052-1.6042-4.3202-5.7157-4.3202-5.7157l-0.1294-0.138s-3.8647-4.6303-5.4243-4.6808c-1.6042-0.0519-2.5603 1.9244-0.6989 2.2969 0.7978 0.1597 0.072-0.8452 1.1788-0.5863 0.9745 0.21 3.4696 3.0563 4.1164 3.7463z" stroke-width=".4835"/>
    <path d="m201.23 155.22c0.4281-0.4201 0.2579-1.2606-0.3964-1.9464-0.6525-0.6412-1.5529-0.8254-1.9365-0.4072-0.4281 0.4201-0.256 1.3052 0.3965 1.9464 0.6524 0.6412 1.5529 0.8254 1.9364 0.4072z" stroke-width=".2416"/>
    <path d="m196.86 154.02s2.3169 2.1896 2.7086 2.6439c0.4363 0.4552 1.342-0.1945 0.9948-0.6478-0.4343-0.5443-2.224-2.3661-2.7939-2.8241-0.57-0.458-1.3486 0.5065-0.9095 0.828z" stroke-width=".2418"/>
    <path d="m195.28 154.13s3.8289 3.6641 4.224 4.1153c0.4397 0.452 1.2958-0.2051 0.9453-0.6558-0.4384-0.5411-3.7378-3.7966-4.3107-4.2949-0.5734-0.4537-1.3001 0.5172-0.8586 0.8354z" stroke-width=".2418"/>
   </g>
   <g>
    <path d="m173.61 181.67-34.611 31.691-15.65 14.337-7.3132 3.1265 3.8879-7.756 9.8861-9.0848 42.833-39.142 13.707-12.589 3.8223 4.1946z" fill="#fff" fill-rule="evenodd" stroke="#1b1918" stroke-width=".0893"/>
    <path d="m116.46 230.48 72.006-65.797" fill="#fff" fill-rule="evenodd" stroke="#1b1918" stroke-width=".1573"/>
    <path d="m155.72 229.92v4.4583" fill="none" stroke="#989fa3" stroke-linecap="square" stroke-width=".4837"/>
   </g>
   <g fill-rule="evenodd">
    <path d="m179.2 255.75 5.5038 21c-7.9458-0.911-20.803-8.956-21.534-11.758-0.1485 2.1656-0.0428 2.8647 0.3728 4.4731-9.9213-6.0135-14.453-24.107-13.894-30.19 3.3175 0.4855 10.831 1.2299 17.466-0.961-0.1866 3.6907 0.2928 7.2014 2.239 10.195 0.0332-1.2626 0.0539-5.0712 0.6969-6.5081 0.8764 1.2903 3.6558 9.3688 9.149 13.75z" fill="#ed6b28"/>
    <path d="m211.14 215.16c-3.7878-10.545-14.186-16.516-21.04-18.169 1.1585 2.6614 2.1944 3.7223 2.3708 6.5066-13.114-10.246-26.556-10.776-42.906-12.483 24.412 13.946 24.128 12.864 36.277 25.614 0.4423-1.8787 0.5096-4.6211-1.4775-8.0933 8.2321 5.2936 10.902 10.791 12.151 12.499 5.0342-1.4004 9.3449-6.444 14.625-5.8747z" fill="#ed6b28"/>
    <path d="m196.01 220.37 12.134-10.628c0.4462-0.3891 3.5458 5.261 4.7812 7.1014 0.6044-2.1951 0.5201-4.0736 0.0493-7.2433 8.2379 12.179 7.4926 31.006 4.9659 36.083 1.7334-0.2703 3.3239-1.7811 4.3575-4.3557 0.146 25.006-28.735 46.377-51.269 30.205 1.0103-5.583 3.8639-11.528 8.0508-15.696 4.478 3.914 11.847 10.854 19.842 7.218 1.6649-0.7572 6.1072-1.6937 8.589-7.7516-3.2418 1.7368-4.4872 2.3779-5.9494 2.7216 7.3838-13.806 1.3683-29.054-5.5509-37.654z" fill="#ffd800"/>
    <path d="m129.69 140.38-5.7588-21c9.7313 2.1862 21.058 8.4459 21.789 11.248 0.1485-2.1656 0.0427-2.3543-0.3729-3.9628 9.9213 6.0134 14.162 22.651 13.603 28.735-3.3173-0.4858-10.54-0.1624-17.175 2.0284 0.1864-3.6907-0.2928-6.8132-2.2391-9.807-0.0333 1.2626-0.0539 5.0712-0.6968 6.5079-0.8765-1.2903-3.6558-9.3688-9.1491-13.749z" fill="#ed6b28"/>
    <path d="m97.749 180.97c3.7878 10.545 14.186 16.516 21.04 18.169-1.1585-2.6616-1.9979-3.5259-2.1743-6.3101 13.114 10.246 26.359 10.579 42.71 12.287-24.412-13.946-24.128-12.864-36.277-25.614-0.4422 1.8788-0.5096 4.6211 1.4775 8.0933-8.2321-5.2935-10.902-10.595-12.249-12.401-5.0343 1.4004-9.2467 6.3457-14.526 5.7765z" fill="#ed6b28"/>
    <path d="m112.69 175.77-11.937 10.628c-0.4461 0.3891-3.5457-5.261-4.7811-7.1013-0.6044 2.1952-0.5201 4.0735-0.0493 7.2433-8.238-12.179-7.4927-31.007-4.9659-36.083-1.7334 0.2704-3.3239 1.7812-4.3574 4.3557-0.1461-25.006 28.734-46.122 51.269-29.95-1.0104 5.5828-3.8641 11.273-8.051 15.441-4.4781-3.9139-11.847-10.854-19.842-7.218-1.6649 0.7571-6.1071 1.6938-8.589 7.7518 3.2418-1.737 4.4871-2.3781 5.9495-2.7218-7.3839 13.806-1.5649 29.054 5.3542 37.654z" fill="#ffd800"/>
    <path d="m134.06 161.39c0.7133 27.33-5.7512 56.353 21.623 72.938 26.393-13.732 22.648-47.838 21.801-72.894-26.973 5.6621-43.424-0.0446-43.424-0.0446z" fill="#fff" stroke="#989fa3" stroke-linecap="square" stroke-width=".5645"/>
    <path d="m138.02 166.25c0.5796 22.604-4.9042 49.933 17.744 63.665 21.801-11.369 18.591-42.889 17.878-63.576-24.565 3.7895-35.622-0.0892-35.622-0.0892z" fill="#fff" stroke="#989fa3" stroke-linecap="square" stroke-width=".6451"/>
    <path d="m165.22 205.13-0.5795 0.535c0.3566 0.6687 0.9808 0.535 1.605 0.535l0.0445 2.8979h-20.419c0.0446 0 0-2.7196 0-2.7642l1.7834-0.6687c-2.3629-1.4713-0.2675-1.8725 0-2.6305l1.1145-1.1145c-1.1591-1.07-0.4012-1.4267-0.5795-2.0954l0.4458-0.6242c-2.6304-3.7004 1.07-6.4646 2.3629-9.4516l1.7833-2.5859c-1.5604-1.3375-2.1845-0.9362-3.522-1.2929-0.7134 0.9363-2.0955 1.3375-3.1655 1.2483-1.0254-2.0508-0.3566-1.9616-3.2099-2.6749-0.7134-6.1525 6.4645-3.745 7.4454-8.7384 6.4199 0.5796 2.2291-4.9487 9.4516-1.9616l1.9171 0.3121c0.4012 0.4012-0.1338 1.2037 0.5795 1.5158l1.9617-0.2675c0.0446 0.1337 1.3375 1.9617 1.3375 1.9617l-1.1146 0.6241 0.2675 0.7134 1.3375-0.535 0.8917 1.917-1.1592 0.4459v0.3566h1.5604v2.5413h-0.9808v0.5796h0.9808v2.5858h-0.9808v0.5796h0.9808l-0.0446 2.4966h-0.9808v0.6688h0.9808v1.9616h-1.0699v0.6688h1.1145v1.9616h-0.8916v0.5796h0.847v2.14h-1.0699s-2.2292 1.605-1.828 2.3629c0.4013 0.7134 0.4013 0.2229-0.0891 1.0254-0.4904 0.8917-1.605 0.223-0.4904 1.2038 1.1145 0.9808 2.0954 1.7387 1.382 2.9871z"/>
   </g>
   <g fill="#004090" fill-rule="evenodd">
    <path d="m77.427 122.2 2.391-2.2296 0.8111 0.8698c0.6439 0.6905 1.2975 0.7609 1.9611 0.2112 0.6609-0.6164 0.6419-1.2969-0.057-2.0465-0.3711-0.3979-0.7666-0.5806-1.1885-0.5454-0.4221 0.0353-1.2541 0.1678-2.4963 0.4073-1.2395 0.2372-2.2824 0.2816-3.1285 0.138-0.8437-0.1461-1.6403-0.6112-2.3854-1.3956-0.0537-0.0969-0.131-0.1996-0.2318-0.3077-0.7765-1.0444-1.1246-2.0384-1.0489-2.9821 0.0758-0.9432 0.596-1.888 1.5564-2.8387 0.6144-0.5729 1.287-0.9795 2.0181-1.2204 0.7288-0.243 1.4829-0.2571 2.2598-0.04 0.7746 0.215 1.5159 0.7045 2.2194 1.4588l0.2223 0.2383-2.3885 2.2274c-0.55-0.5897-1.0158-0.9318-1.3956-1.0186-0.3772-0.0892-0.7181 8e-3 -1.0204 0.29-0.494 0.4605-0.5079 0.9973-0.0397 1.6127 0.3597 0.3858 0.779 0.5645 1.258 0.5313 0.4789-0.0332 1.2731-0.1671 2.3771-0.4019 1.1089-0.2348 2.0485-0.316 2.8206-0.2416 0.7771 0.0748 1.4971 0.4232 2.167 1.0529 0.1106 0.0989 0.2622 0.2516 0.4548 0.4579 0.7813 0.838 1.2665 1.649 1.4575 2.4401 0.1889 0.7888 0.1368 1.5309-0.161 2.2266-0.2952 0.6934-0.777 1.3542-1.4454 1.9774-0.5726 0.534-1.2072 0.9373-1.8988 1.2103-0.6943 0.2751-1.3816 0.3512-2.0691 0.2296-0.6877-0.1215-1.3099-0.4785-1.8644-1.0731zm11.415-3.6611-9.3333-11.946 2.8277-2.2093 3.5888 4.5936 1.9249-1.5037-3.5889-4.5936 2.7958-2.1845 9.3334 11.946-2.7959 2.1844-3.8847-4.9722-1.9248 1.5037 3.8847 4.9724zm8.6-6.6291-4.6965-14.747 3.7156-2.1454 10.391 11.459-3.1104 1.796-1.8632-2.2998-2.4238 1.3994 1.0948 2.7433zm1.0313-7.0436 1.7605-1.0164-4.2743-5.3537zm9.7716 0.9107-6.1497-13.813 3.5912-1.5989c0.0552-0.0246 0.1336-0.063 0.2446-0.12 0.1078-0.0553 0.1892-0.0951 0.2475-0.1211 1.1725-0.5221 2.1553-0.7683 2.9482-0.7388 0.7897 0.0308 1.3998 0.2116 1.8302 0.5421 0.4305 0.3306 0.753 0.6837 0.9616 1.0615 0.2075 0.3747 0.3659 0.6646 0.4741 0.8665l2.8876 6.4858c1.0661 2.394 0.2546 4.1896-2.4342 5.3868zm2.1343-3.9295c0.4882-0.2173 0.8577-0.4112 1.1074-0.5777 0.2497-0.1662 0.4238-0.3944 0.5163-0.6821 0.0956-0.2892 0.0569-0.6652-0.1101-1.1316l-2.5269-5.6754c-0.2381-0.4604-0.4505-0.7888-0.6345-0.9789-0.1841-0.1904-0.4495-0.2745-0.7948-0.2567-0.3421 0.0162-0.8394 0.1714-1.4932 0.4625zm6.9641-4.9081-2.0537-6.3207c-0.4715-1.5707-0.3845-2.8144 0.2581-3.7402 0.6422-0.9259 1.6399-1.607 2.9915-2.0461 0.6295-0.2046 1.2359-0.3168 1.8185-0.34 0.5824-0.0231 1.1416 0.067 1.6726 0.2656 0.5317 0.2017 1.0116 0.5368 1.434 1.0108 0.4237 0.477 0.7589 1.0958 1.0091 1.866l2.0537 6.3205c0.2768 1.037 0.3743 1.9239 0.2911 2.668-0.0876 0.7423-0.407 1.3899-0.9635 1.9383-0.5589 0.5524-1.4029 1.0104-2.5372 1.379-1.0961 0.3562-2.0298 0.4511-2.8062 0.2901-0.7776-0.1642-1.4146-0.5262-1.9127-1.0921-0.4974-0.5625-0.9158-1.2956-1.2553-2.1992zm1.2584-7.7395 0.0613 0.3192 2.0682 6.3653c0.1724 0.5305 0.4179 0.9383 0.7356 1.22 0.3177 0.282 0.6806 0.3548 1.0895 0.222 0.4315-0.1402 0.6778-0.404 0.7445-0.7966 0.0679-0.3895-8e-3 -0.916-0.2229-1.5775l-2.0183-6.2119-0.0997-0.3067c-0.3373-0.9078-0.8895-1.2372-1.6564-0.988-0.6606 0.2605-0.8946 0.8453-0.7018 1.7542zm12.938 8.0065-5.1071-14.452 3.3717-0.5946 2.8777 10.284 0.0316-0.0531-0.388-10.675 3.3784-0.5956 3.1557 10.235 0.0282-0.0527-0.7022-10.62 3.2955-0.5812 0.1438 15.328-3.9309 0.6931-2.9174-10.277-0.0431 0.0076 0.6774 10.672zm21-2.7055-2.2556-15.161 3.4232 0.0597 0.8626 10.644 0.0413-0.0462 1.6559-10.553 3.43 0.0598 1.1448 10.649 0.0379-0.0463 1.3369-10.559 3.3458 0.0584-2.7833 15.073-3.991-0.0697-0.9029-10.645-0.0437-8e-4 -1.3713 10.605zm13.249 0.1827 5.8815-14.316 4.2254 0.7451 0.594 15.458-3.5371-0.6237 0.0509-2.9593-2.7563-0.4861-0.9244 2.8054zm5.3175-4.7327 2.002 0.353 0.167-6.8486zm6.6412 6.9478 4.1676-14.534 5.1159 1.467c0.8656 0.2481 1.5608 0.5908 2.0791 1.0259 0.5183 0.4355 0.8561 0.9761 1.0143 1.6193 0.1572 0.6461 0.1329 1.4012-0.0748 2.2713-0.1935 0.6752-0.4177 1.226-0.6752 1.6485-0.2553 0.4267-0.5616 0.7512-0.9093 0.9767-0.3509 0.2243-0.7752 0.3753-1.2665 0.4546 0 0-0.0197 0.0084-0.054 0.03 0.4264 0.1223 0.7502 0.4318 0.9712 0.9286 0.2211 0.4969 0.3009 0.974 0.2363 1.4309l-0.8244 3.4722c-0.2367 1.033-0.2475 1.6313-0.0354 1.7934l-0.0556 0.1938-3.6949-1.0594c-0.0444-0.1981-0.06-0.3878-0.0381-0.5739 0.0186-0.1868 0.1154-0.5854 0.2905-1.1959l0.4676-1.631c0.2232-0.7783 0.3061-1.3837 0.2459-1.8204-0.0568-0.4357-0.3067-0.7346-0.7454-0.8989l-1.1659-0.3343-1.6383 5.7134zm5.8102-7.3902 1.1659 0.3343c0.4038 0.1157 0.7527 0.069 1.05-0.1394 0.2977-0.2083 0.5554-0.6935 0.775-1.4589 0.1935-0.6751 0.1044-1.169-0.2662-1.485-0.375-0.3137-0.9413-0.581-1.7069-0.8005zm5.2916 10.684 5.4184-14.115 4.9686 1.9074c0.8407 0.3227 1.5034 0.7246 1.9817 1.2032 0.4785 0.4789 0.7678 1.047 0.8694 1.7015 0.1003 0.6573 0.0103 1.4075-0.2724 2.2563-0.2516 0.6556-0.5232 1.1848-0.8164 1.5834-0.2914 0.4027-0.6248 0.6992-0.9908 0.8935-0.3693 0.193-0.8051 0.3064-1.3014 0.3427 0 0-0.0204 0.0067-0.0565 0.0251 0.4142 0.1589 0.7097 0.4954 0.8866 1.0097 0.177 0.5143 0.2149 0.9965 0.1106 1.4461l-1.1238 3.3871c-0.3259 1.0084-0.3886 1.6034-0.1915 1.7835l-0.0722 0.1881-3.5885-1.3773c-0.027-0.2013-0.0261-0.3916 0.012-0.575 0.0348-0.1846 0.1659-0.5731 0.3935-1.166l0.6082-1.584c0.2901-0.7559 0.4254-1.352 0.4035-1.7922-0.0186-0.439-0.2415-0.7586-0.6642-0.9603l-1.1324-0.4348-2.1299 5.5489zm6.4323-6.8557 1.1322 0.4346c0.3921 0.1505 0.7439 0.1344 1.0582-0.0473 0.3146-0.1815 0.6138-0.6426 0.8992-1.3859 0.2516-0.6556 0.2059-1.1553-0.1359-1.5025-0.3462-0.3452-0.887-0.6608-1.6305-0.9462zm4.232 11.26 6.8825-13.507 3.1972 1.6291-6.8824 13.507zm7.5925-1.0556 3.6196-5.5737c0.924-1.3549 1.9452-2.07 3.069-2.1534 1.1239-0.0835 2.2809 0.2634 3.4729 1.0374 0.5551 0.3605 1.024 0.7611 1.4084 1.1992 0.3846 0.4381 0.6665 0.9294 0.8462 1.4669 0.178 0.5403 0.2196 1.124 0.1172 1.7507-0.1043 0.6294-0.3742 1.2794-0.8151 1.9585l-3.6197 5.5736c-0.6317 0.8678-1.2595 1.5015-1.8904 1.9053-0.6317 0.3991-1.3362 0.5585-2.1126 0.471-0.7809-0.0867-1.668-0.4543-2.6683-1.104-0.9666-0.6276-1.6278-1.2935-1.9915-1.9983-0.3616-0.7077-0.4813-1.4304-0.3551-2.1736 0.1245-0.7405 0.4308-1.527 0.9194-2.3596zm6.8066-3.8927-0.2096 0.2486-3.6452 5.6131c-0.3038 0.4679-0.4662 0.9152-0.4852 1.3395-0.0191 0.4243 0.1525 0.7521 0.5132 0.9863 0.3805 0.2471 0.7405 0.2725 1.0875 0.0773 0.3455-0.1924 0.707-0.5826 1.0857-1.1658l3.5575-5.4779 0.1757-0.2705c0.4932-0.8336 0.4016-1.4699-0.2746-1.9091-0.6185-0.3494-1.2201-0.1634-1.805 0.5585zm0.5363 13.861 9.3086-11.914 4.1938 3.2766c0.7097 0.5543 1.2259 1.1326 1.5434 1.7301 0.3176 0.5978 0.4281 1.2256 0.334 1.8812-0.0964 0.6581-0.4018 1.349-0.9202 2.0781-0.4324 0.5534-0.8467 0.9801-1.2437 1.2755-0.3965 0.2998-0.8019 0.486-1.2088 0.5649-0.4095 0.0765-0.8594 0.0575-1.3446-0.0529 0 0-0.0215 4e-4 -0.0613 8e-3 0.3495 0.273 0.5337 0.6813 0.5526 1.2248 0.0188 0.5435-0.0859 1.0159-0.317 1.4153l-2.065 2.9104c-0.6066 0.8692-0.8405 1.4199-0.7047 1.6496l-0.1241 0.1589-3.029-2.3664c0.033-0.2004 0.0897-0.3821 0.1796-0.5463 0.0873-0.1663 0.3263-0.4997 0.7173-1l1.0446-1.337c0.4986-0.6381 0.8021-1.1685 0.91-1.5958 0.1105-0.4254-9e-3 -0.796-0.3544-1.1127l-0.9558-0.7467-3.6593 4.6836zm8.1557-4.6757 0.9558 0.7467c0.3309 0.2585 0.6719 0.346 1.0257 0.2642 0.3538-0.0817 0.7748-0.435 1.265-1.0625 0.4324-0.5534 0.5348-1.0447 0.3094-1.4766-0.2301-0.4313-0.6551-0.8913-1.2826-1.3816zm3.8308 7.819 2.3517 2.2708-0.8263 0.8556c-0.6559 0.6792-0.6919 1.3356-0.1082 1.9694 0.6502 0.6278 1.3288 0.5732 2.0407-0.1639 0.3781-0.3915 0.5397-0.7959 0.4825-1.2155-0.0573-0.4195-0.2331-1.2435-0.5374-2.4713-0.3018-1.2256-0.4007-2.2647-0.3015-3.1171 0.1016-0.8502 0.5245-1.6701 1.2688-2.4553 0.094-0.0586 0.1924-0.1412 0.2951-0.2475 1.0024-0.8302 1.9769-1.2297 2.9231-1.2035 0.9461 0.0263 1.9166 0.4965 2.9163 1.4057 0.6041 0.5835 1.0456 1.234 1.3243 1.9515 0.281 0.715 0.3345 1.4674 0.1581 2.2545-0.174 0.7848-0.624 1.5507-1.3405 2.2927l-0.2264 0.2344-2.3492-2.2686c0.5601-0.5801 0.8773-1.0631 0.9441-1.4469 0.0694-0.3815-0.0457-0.7167-0.343-1.0039-0.4857-0.469-1.0226-0.4551-1.6126 0.0448-0.3664 0.3794-0.5229 0.8075-0.4646 1.2842 0.0581 0.4765 0.2335 1.2624 0.5257 2.3528 0.2924 1.0949 0.4227 2.0289 0.3887 2.804-0.0338 0.78-0.3441 1.5172-0.9379 2.2191-0.0929 0.1158-0.2375 0.2751-0.4335 0.4782-0.7959 0.8241-1.5804 1.351-2.3606 1.5832-0.7776 0.2298-1.5216 0.2167-2.232-0.0443-0.7078-0.2584-1.3927-0.7051-2.0502-1.3399-0.563-0.5438-0.9991-1.1564-1.308-1.8329-0.3111-0.6789-0.423-1.3613-0.3376-2.0544 0.0854-0.693 0.4092-1.333 0.974-1.9178z"/>
    <path d="m50.54 236.17c0.1189 0.2846 0.2824 0.4735 0.4935 0.5655 0.211 0.0917 0.4437 0.1122 0.6943 0.07 0.2537-0.0435 0.5594-0.1383 0.9232-0.2793 0.3624-0.1439 0.7153-0.2841 1.059-0.4201 0.7446-0.3112 1.2246-0.622 1.4408-0.9401 0.2175-0.3151 0.254-0.6498 0.1037-1.0098-0.2982-0.7132-1.1666-0.7691-2.6057-0.1678-0.6506 0.2717-1.137 0.497-1.455 0.6775-0.3206 0.1817-0.5417 0.3917-0.6641 0.6265-0.1241 0.2394-0.1195 0.5313 0.0103 0.8776zm-1.1829 1.7068c-0.3059-0.1515-0.6143-0.3974-0.9254-0.7377-0.3113-0.3403-0.5678-0.7256-0.7708-1.1588-0.2107-0.5477-0.2807-1.1027-0.2075-1.666 0.0702-0.5621 0.3478-1.1117 0.83-1.6549 0.4804-0.5387 1.1961-1.0068 2.1407-1.4014 1.2013-0.502 2.2282-0.8061 3.0847-0.9104 0.8566-0.1043 1.6126 0.0429 2.2722 0.4434 0.6597 0.4005 1.2324 1.1202 1.7256 2.1597 0.5032 1.2045 0.6411 2.2382 0.4118 3.1055-0.2304 0.8642-0.6369 1.5448-1.2206 2.0387-0.5836 0.4936-1.2275 0.8875-1.9251 1.1789l-4.8084 2.009c-0.8353 0.349-1.6596 0.5833-2.4625 0.7017-0.8059 0.12-1.6035-0.0208-2.398-0.4273-0.79-0.4049-1.4362-1.204-1.9344-2.396-0.3031-0.8139-0.4693-1.5456-0.4949-2.1964-0.0256-0.6505 0.1527-1.2616 0.5376-1.8265 0.3818-0.5637 1.0304-1.0515 1.9442-1.459l1.2547 3.0033c-0.8885 0.3711-1.1942 0.8883-0.917 1.5515 0.1882 0.4065 0.42 0.6182 0.6922 0.6368 0.2767 0.0203 0.6381-0.0205 1.0873-0.1236zm0.441 9.8539c0.2265 0.4401 0.5413 0.6442 0.9381 0.6078 0.3984-0.0334 0.8607-0.1873 1.3853-0.4573l5.8575-3.0142c1.1576-0.5957 1.5658-1.2253 1.2245-1.8885-0.2265-0.44-0.5215-0.6352-0.8894-0.587-0.368 0.0483-0.8224 0.2097-1.359 0.4857l-5.8575 3.0143c-0.5457 0.2808-0.889 0.4881-1.0346 0.62-0.4098 0.3597-0.4992 0.764-0.2649 1.2192zm-0.825-4.5895 6.7076-3.4517c0.8743-0.4498 1.6711-0.65 2.395-0.5994 0.7222 0.0478 1.3621 0.3056 1.9181 0.7785 0.5543 0.4697 1.0378 1.1054 1.4521 1.9104 0.4359 0.8471 0.6934 1.6219 0.7699 2.3261 0.0749 0.7013-0.0932 1.3673-0.5121 1.9984-0.4157 0.6298-1.1429 1.2174-2.1797 1.7661l-5.8575 3.0141c-1.0039 0.5167-1.8896 0.7742-2.6538 0.7708-0.7613-5e-3 -1.4205-0.2336-1.9762-0.6913-0.5542-0.4544-1.0547-1.1159-1.4999-1.9811-0.6251-1.2148-0.8369-2.3374-0.635-3.3756 0.1988-1.0363 0.8897-1.8572 2.0715-2.4653zm2.5866 12.479 6.858-4.2416-0.9827-1.5889 1.7145-1.0603 3.2379 5.2349-1.7145 1.0603-1.011-1.6343-6.858 4.2416zm2.8687 4.6415 8.3811-5.6479 1.3368 1.9839-3.2209 2.1706 0.9086 1.3484 3.2211-2.1705 1.322 1.9616-8.3813 5.648-1.3218-1.9617 3.4882-2.3507-0.9086-1.3486-3.4883 2.3509z"/>
    <path d="m70.615 272.49 2.4335 2.6212-1.6573 1.5388c-0.6934 0.6435-1.4377 0.9877-2.2312 1.035-0.7957 0.0449-1.5478-0.1175-2.2585-0.4894-0.7106-0.3718-1.3291-0.8384-1.855-1.405-0.7635-0.8225-1.2622-1.6087-1.4959-2.354-0.2362-0.7477-0.2113-1.4783 0.0694-2.1925 0.2857-0.7138 0.8186-1.4354 1.6064-2.1666l4.8301-4.4842c1.0261-0.9528 2.0934-1.4626 3.2071-1.5387 1.1159-0.0738 2.2828 0.5453 3.5008 1.8573 0.5329 0.5739 0.9387 1.1409 1.2226 1.7056 0.286 0.5624 0.4357 1.1221 0.4559 1.677 0.0176 0.5573-0.101 1.1023-0.361 1.6443-0.2599 0.5374-0.6632 1.0598-1.2148 1.572l-0.2061 0.1913-0.733 0.6805-2.4636-2.6536 0.7329-0.6805c0.4746-0.4405 0.7632-0.8473 0.8632-1.2178 0.1003-0.3707 0.0257-0.69-0.2233-0.9583l-0.0278-0.0298c-0.2962-0.2894-0.5927-0.4491-0.8888-0.4842-0.2936-0.0373-0.653 0.1391-1.0703 0.5265l-5.6502 5.2456c-0.6461 0.5997-0.6923 1.1977-0.141 1.7917 0.5467 0.5887 1.2166 0.5728 2.0074-0.0504l0.5048-0.413zm1.6781 10.294 4.3306-4.6954 3.3516-8.9746 2.6766 2.4686-2.0766 4.897 0.0275 0.0253 4.7406-2.4398 2.6318 2.4274-8.7345 4.0096-4.3307 4.6954zm6.4777 5.8546 8.9662-12.344 3.9173 2.8453c1.0889 0.791 1.8072 1.6772 2.1591 2.6579 0.3547 0.9827 0.1551 2.0193-0.5919 3.111-0.5778 0.7955-1.1229 1.292-1.642 1.4933-0.5143 0.2004-1.1166 0.2911-1.8037 0.2738 0.2468 0.5773 0.3954 1.0708 0.4451 1.4756 0.0495 0.4048-0.0022 0.7989-0.1503 1.1816-0.1528 0.3835-0.4283 0.8496-0.8307 1.4037-0.5719 0.7872-1.1812 1.3547-1.8283 1.6977-0.6491 0.3456-1.3507 0.4518-2.1123 0.3176-0.7616-0.1339-1.5772-0.517-2.4468-1.1484zm4.5106-0.1179c0.1018 0.0906 0.257 0.2117 0.4654 0.363 0.4718 0.3429 0.8667 0.5376 1.1848 0.5843 0.3182 0.0465 0.581-0.01 0.7928-0.1743 0.2098-0.1619 0.4473-0.4252 0.7143-0.7929 0.3087-0.4251 0.476-0.7938 0.5065-1.107 0.0257-0.3124-0.0751-0.6119-0.3054-0.9007-0.2329-0.2908-0.6146-0.6308-1.1467-1.0173zm3.8257-5.2669c0.5321 0.3865 0.9597 0.6343 1.2848 0.7407 0.3251 0.1062 0.6043 0.0909 0.8404-0.0435 0.2339-0.1318 0.4978-0.3968 0.7867-0.7946 0.269-0.3704 0.392-0.6958 0.3663-0.9659-0.0239-0.2729-0.136-0.5051-0.3295-0.7002-0.1964-0.1972-0.5405-0.4848-1.0359-0.8697zm1.3694 12.49 7.9906-13.045 6.9734 4.2716-1.5938 2.602-3.9205-2.4013-1.4769 2.4112 3.8192 2.3392-1.5938 2.6022-3.8192-2.3395-1.7321 2.8274 4.1603 2.5485-1.5939 2.602zm8.9808 5.3708 6.9114-13.602 4.7847 2.4313c0.8131 0.4132 1.4332 0.8842 1.8634 1.4147s0.6615 1.1308 0.695 1.7983c0.0336 0.6673-0.1366 1.4138-0.5074 2.2332-0.3209 0.6316-0.6486 1.1344-0.9862 1.5067-0.3329 0.3709-0.6984 0.634-1.0861 0.7905-0.3908 0.1551-0.84 0.2235-1.3417 0.2083 0 0-0.0213 4e-3 -0.0594 0.0192 0.3991 0.2029 0.6635 0.5729 0.7845 1.1059 0.1238 0.5346 0.1116 1.0226-0.0399 1.4629l-1.483 3.2852c-0.4324 0.9783-0.5575 1.5688-0.3785 1.7701l-0.092 0.1814-3.4578-1.757c-6e-3 -0.2046 0.0146-0.3956 0.0719-0.5758 0.0543-0.1816 0.2265-0.5579 0.5169-1.1292l0.7771-1.5294c0.3686-0.7254 0.5663-1.3094 0.5951-1.755 0.0242-0.4441-0.1631-0.7865-0.5665-1.0332l-1.0911-0.5545-2.7185 5.3499zm7.1728-6.2126 1.0911 0.5545c0.3748 0.1903 0.7296 0.2109 1.064 0.0614 0.3345-0.1495 0.6832-0.5808 1.0456-1.2943 0.321-0.6316 0.3273-1.138 0.0205-1.5222-0.3084-0.3809-0.8184-0.7543-1.5348-1.1182zm4.7444 6.6597 3.0968 1.1272-0.4105 1.1278c-0.3259 0.8953-0.0898 1.5153 0.7085 1.8599 0.857 0.312 1.4602-0.0168 1.814-0.9886 0.1878-0.516 0.1708-0.9552-0.054-1.3184-0.2251-0.3634-0.7254-1.0507-1.5065-2.0566-0.7812-1.0061-1.302-1.9243-1.5572-2.7498-0.2551-0.8252-0.2031-1.7516 0.162-2.7842 0.0626-0.0925 0.1194-0.209 0.1704-0.3492 0.5836-1.1767 1.3146-1.9461 2.2008-2.309 0.8829-0.3641 1.9707-0.3289 3.2622 0.0978 0.7964 0.2899 1.4704 0.7086 2.0217 1.2556 0.5525 0.5438 0.9106 1.2154 1.0711 2.0136 0.1616 0.7948 0.0611 1.6854-0.2949 2.6635l-0.1126 0.3091-3.0966-1.1273c0.2783-0.7647 0.3722-1.3402 0.2765-1.7214-0.0925-0.3801-0.3363-0.642-0.7282-0.7846-0.6404-0.2332-1.1293 2e-4 -1.4682 0.703-0.1821 0.5004-0.1506 0.9591 0.0986 1.3745 0.2492 0.4156 0.7333 1.068 1.4502 1.9531 0.7189 0.8896 1.2224 1.6971 1.5092 2.4257 0.2888 0.7328 0.3053 1.5399 0.0461 2.4305-0.0383 0.1448-0.1061 0.3511-0.2035 0.6186-0.3954 1.0864-0.9024 1.8942-1.5263 2.4282-0.6227 0.5311-1.3138 0.8243-2.0724 0.8765-0.7618 0.051-1.5767-0.0795-2.4401-0.3938-0.7454-0.2714-1.3988-0.6572-1.9612-1.1542s-0.9452-1.0802-1.151-1.754-0.17-1.3969 0.1107-2.1678zm9.0642 8.6138 4.0271-14.716 4.2185 1.1543c0.8797 0.2408 1.6487 0.5391 2.3136 0.8969 0.6649 0.3576 1.18 0.9416 1.5445 1.7548 0.3645 0.8134 0.3594 1.8982-0.0111 3.2519-0.3232 1.0646-0.7356 1.8656-1.2361 2.3967-0.5011 0.5341-1.0595 0.8664-1.6751 0.9965-0.6148 0.1272-1.227 0.1424-1.835 0.0393-0.6089-0.0999-1.3854-0.2809-2.3306-0.5394l-1.5626 5.7097zm5.7406-7.4134 0.1375 0.0375c0.69 0.1889 1.2169 0.2416 1.5797 0.1616 0.3629-0.0799 0.6181-0.2421 0.7658-0.4864 0.1435-0.2419 0.2957-0.6184 0.4551-1.1232 0.1862-0.6802 0.172-1.1551-0.0458-1.4256-0.2144-0.2696-0.5571-0.4689-1.0281-0.5978-0.1106-0.0584-0.2671-0.1153-0.4765-0.1726l-0.3727-0.1019zm4.0525 10.21 6.0734-14.388 4.2565 0.7929 0.4494 15.603-3.5631-0.6636 0.0801-2.9854-2.7764-0.5171-0.9602 2.8215zm5.4115-4.7238 2.0166 0.3756 0.2349-6.909zm13.584 1.4948 3.5589 0.3583-0.2265 2.2501c-0.0948 0.9411-0.4259 1.6915-0.9899 2.2515-0.5675 0.5597-1.2391 0.9351-2.0182 1.1257-0.779 0.1908-1.5516 0.2494-2.3207 0.1721-1.1167-0.1124-2.0105-0.3729-2.6785-0.7775-0.6714-0.4048-1.1359-0.9695-1.3973-1.691-0.2575-0.7245-0.3345-1.6181-0.2269-2.6875l0.6601-6.5577c0.1401-1.3932 0.6039-2.4814 1.3894-3.2747 0.7884-0.7929 2.0732-1.0998 3.8545-0.9205 0.7793 0.0784 1.4585 0.2355 2.0447 0.4716 0.5865 0.2328 1.0686 0.5539 1.4507 0.9571 0.3816 0.4064 0.6529 0.8937 0.8162 1.4723 0.16 0.5749 0.2029 1.2335 0.1275 1.9825l-0.0281 0.28-0.1002 0.9951-3.6028-0.3627 0.1002-0.9951c0.0649-0.6442 0.0125-1.1402-0.1573-1.4844-0.1697-0.3443-0.4369-0.5348-0.8012-0.5714l-0.0405-4e-3c-0.4135-0.0213-0.7416 0.0548-0.9868 0.2243-0.2451 0.1662-0.3981 0.5359-0.4551 1.1026l-0.7723 7.671c-0.0882 0.877 0.2724 1.3563 1.0788 1.4375 0.7994 0.0805 1.2916-0.3743 1.4729-1.3646l0.1059-0.6437zm5.2693 6.2258-0.3953-15.292 8.175-0.2112 0.0789 3.0502-4.596 0.1188 0.073 2.8266 4.4773-0.1158 0.0789 3.0505-4.4773 0.1157 0.0857 3.3147 4.8772-0.126 0.0787 3.0504z"/>
    <path d="m167.84 310.97-1.0664-6.621c-0.2262-1.6393 0.053-2.8692 0.8378-3.6892 0.7843-0.8234 1.8847-1.3475 3.3006-1.5758 0.6595-0.106 1.2816-0.1238 1.8659-0.0565 0.5845 0.0675 1.128 0.2442 1.6263 0.5247 0.4989 0.2836 0.9254 0.6922 1.2732 1.2303 0.3481 0.5415 0.5862 1.2105 0.7162 2.0172l1.0662 6.6209c0.1151 1.0768 0.0746 1.9764-0.1238 2.7055-0.2025 0.7263-0.6216 1.3226-1.2651 1.7832-0.6397 0.4637-1.5523 0.7892-2.7404 0.9807-1.1482 0.1849-2.0939 0.1346-2.8431-0.1465-0.7497-0.2846-1.3287-0.7443-1.7376-1.3856-0.4084-0.6383-0.7117-1.4342-0.9098-2.3879zm2.4561-7.5215 0.0117 0.3281 1.0737 6.6675c0.0897 0.5557 0.271 1.0004 0.544 1.3309 0.273 0.3303 0.6235 0.4592 1.0519 0.3903 0.4518-0.0729 0.7385-0.2978 0.8661-0.6788 0.1278-0.3778 0.1343-0.9144 0.0225-1.6073l-1.0478-6.5071-0.0517-0.3214c-0.1954-0.9575-0.6948-1.3716-1.4983-1.2423-0.6991 0.1575-1.0231 0.704-0.9721 1.6401zm10.309 9.7201-4.2568-14.651 4.1999-1.2202c0.8758-0.2544 1.6872-0.4021 2.4411-0.4444 0.7538-0.0426 1.4981 0.1862 2.2339 0.689 0.7357 0.5031 1.2983 1.4306 1.6899 2.7784 0.2808 1.0765 0.3477 1.975 0.1987 2.6891-0.1481 0.7175-0.4508 1.2926-0.9075 1.7253-0.4576 0.4296-0.9716 0.7626-1.544 0.9923-0.5713 0.2332-1.3278 0.4847-2.269 0.7581l1.6517 5.6845zm1.0202-9.3206 0.1366-0.0398c0.687-0.1996 1.1639-0.43 1.4315-0.6877 0.2676-0.2578 0.4003-0.5294 0.3986-0.8148-4e-3 -0.2814-0.0711-0.6819-0.1991-1.1956-0.1966-0.6773-0.457-1.0748-0.7838-1.1914-0.3238-0.118-0.7202-0.1088-1.1891 0.0274-0.1246 8e-3 -0.2879 0.0415-0.4964 0.1019l-0.3711 0.1078zm10.236 6.1166-5.4465-14.295 7.6418-2.9116 1.0864 2.8513-4.2962 1.6371 1.0067 2.6423 4.1854-1.5948 1.0864 2.8513-4.1852 1.5948 1.1805 3.0986 4.559-1.7372 1.0864 2.8513zm9.8924-3.7794-6.5615-13.774 4.8451-2.3083c0.8235-0.3923 1.575-0.5962 2.2577-0.6137 0.6829-0.0172 1.2996 0.1659 1.849 0.5465 0.5492 0.3805 1.037 0.9707 1.4602 1.7642 0.3047 0.6399 0.503 1.2061 0.5922 1.7007 0.0907 0.49 0.0762 0.9403-0.036 1.3429-0.1156 0.4041-0.3354 0.8019-0.6537 1.1902 0 0-0.01 0.0194-0.0209 0.0587 0.4041-0.1924 0.8587-0.1762 1.3546 0.0532 0.4992 0.228 0.8786 0.5353 1.1351 0.9238l1.6985 3.1792c0.5113 0.9394 0.9029 1.3988 1.1716 1.3797l0.0876 0.1837-3.5015 1.668c-0.166-0.12-0.3046-0.2529-0.4124-0.4081-0.1108-0.1538-0.3038-0.5199-0.5795-1.0983l-0.7378-1.549c-0.3499-0.7346-0.692-1.2475-1.0277-1.5421-0.3372-0.29-0.7227-0.3505-1.1643-0.1814l-1.1048 0.5264 2.5809 5.4176zm-0.5471-9.4735 1.1049-0.5263c0.3796-0.1808 0.6121-0.4492 0.6978-0.8056 0.0856-0.3561-0.0436-0.8956-0.3878-1.618-0.3047-0.6397-0.7022-0.9535-1.1935-0.9448-0.4902 0.0121-1.0972 0.1886-1.8226 0.534zm10.496 4.555-5.336-14.678 3.6592-2.3144 10.943 11.131-3.0632 1.9374-1.9719-2.2428-2.3869 1.5097 1.2156 2.7214zm0.7531-7.1436 1.7335-1.0966-4.5276-5.2238zm10.953-0.3046-7.316-9.77-2.2633 1.6949-1.8287-2.4426 7.4577-5.5845 1.8288 2.4427-2.3285 1.7435 7.3159 9.7699zm6.7567-5.1254-10.098-11.491 2.7196-2.3902 10.099 11.49zm1.4651-6.9462-4.62-4.8609c-1.1127-1.225-1.5769-2.3977-1.3924-3.5176 0.1819-1.1224 0.794-2.1766 1.8334-3.1645 0.4843-0.4602 0.9875-0.8263 1.5078-1.1007 0.5202-0.2746 1.0686-0.4359 1.6382-0.4859 0.5721-0.0478 1.1548 0.0486 1.7456 0.2962 0.5932 0.2502 1.1676 0.6675 1.7307 1.2599l4.6197 4.8611c0.7033 0.8237 1.1781 1.5888 1.4259 2.3023 0.2433 0.7138 0.2343 1.4426-0.0364 2.1863-0.266 0.744-0.8351 1.5281-1.7075 2.3572-0.8429 0.801-1.6516 1.2937-2.4288 1.485-0.7794 0.1887-1.5167 0.1363-2.2166-0.1618-0.6975-0.296-1.3973-0.7815-2.0996-1.4566zm-2.2218-7.5939 0.1949 0.264 4.6524 4.8956c0.3878 0.4079 0.7886 0.6724 1.2005 0.7908 0.4119 0.1183 0.774 0.0268 1.0886-0.2722 0.3316-0.3153 0.4413-0.6628 0.3313-1.0491-0.1079-0.384-0.4059-0.8305-0.8892-1.3393l-4.5405-4.7774-0.2243-0.2359c-0.7021-0.6799-1.348-0.7394-1.938-0.1788-0.4881 0.5247-0.4467 1.1588 0.1243 1.9023zm13.72 2.216-11.726-9.7608 2.3709-2.8482 8.3084 3.3737 0.0541-0.0652-6.7901-5.1976 2.1866-2.6266 11.726 9.7608-2.3664 2.8429-8.3495-3.324 5e-3 0.0573 6.7412 5.1924zm2.9539-11.558 1.9053-2.689 0.9791 0.6938c0.7775 0.5508 1.4379 0.4868 1.981-0.1919 0.5274-0.7445 0.3696-1.4129-0.4743-2.0109-0.4481-0.3174-0.8762-0.417-1.2859-0.296-0.4098 0.1209-1.2048 0.4221-2.3813 0.9095-1.1767 0.4878-2.2001 0.7475-3.0635 0.7756-0.8635 0.0281-1.743-0.2668-2.6424-0.8916-0.0729-0.0848-0.1702-0.1703-0.2921-0.2567-0.9805-0.8736-1.5296-1.7819-1.6455-2.7326-0.1181-0.9476 0.2034-1.9875 0.956-3.1203 0.49-0.6916 1.0719-1.2311 1.7449-1.6183 0.6705-0.3892 1.4129-0.5571 2.225-0.5013 0.8094 0.0542 1.6418 0.3864 2.4912 0.9882l0.2683 0.1901-1.9052 2.6889c-0.6639-0.4704-1.1943-0.7131-1.5872-0.7213-0.3911-0.0113-0.7081 0.1547-0.9492 0.4949-0.394 0.5561-0.2981 1.0894 0.2903 1.6018 0.4345 0.3078 0.8853 0.3987 1.3517 0.2679 0.4666-0.1306 1.2238-0.425 2.2669-0.8827 1.0478-0.4584 1.9596-0.7306 2.7382-0.8148 0.783-0.0851 1.5657 0.1123 2.3564 0.5975 0.1294 0.0752 0.3105 0.1951 0.5427 0.3597 0.9434 0.6684 1.5885 1.3707 1.939 2.1134 0.3477 0.741 0.4478 1.4851 0.2979 2.2304-0.1522 0.7483-0.4933 1.4996-1.0245 2.2493-0.4587 0.6475-1.0033 1.1756-1.6313 1.5867-0.6276 0.4111-1.2913 0.6265-1.9956 0.647s-1.3921-0.2052-2.0615-0.6795z"/>
    <path d="m253.96 252.09 1.3737-2.9956 1.091 0.5003c0.8659 0.3973 1.5031 0.2119 1.9109-0.5559 0.3803-0.8289 0.1014-1.4569-0.8386-1.8878-0.4993-0.2291-0.9385-0.2475-1.3187-0.0527-0.3803 0.1949-1.1057 0.6381-2.1715 1.3354-1.0657 0.6973-2.0234 1.1423-2.8666 1.3299s-1.7623 0.061-2.7618-0.3864c-0.0873-0.0698-0.1989-0.1357-0.3346-0.1981-1.1256-0.6766-1.8334-1.4675-2.1234-2.38-0.2918-0.9094-0.1689-1.9909 0.3608-3.2438 0.3532-0.7702 0.8251-1.4083 1.4148-1.9134 0.5867-0.5068 1.2849-0.8095 2.0934-0.9051 0.8054-0.0968 1.6851 0.0752 2.631 0.5092l0.2991 0.1372-1.3737 2.9955c-0.7397-0.3393-1.3058-0.4794-1.6934-0.4148-0.3864 0.0616-0.6672 0.2833-0.841 0.6624-0.2841 0.6194-0.0909 1.1256 0.5821 1.5202 0.484 0.2219 0.9438 0.2276 1.378 0.0129 0.4344-0.215 1.1237-0.6448 2.064-1.2879 0.9448-0.6446 1.7901-1.0813 2.5395-1.3083 0.7538-0.2285 1.5596-0.18 2.4264 0.1504 0.1413 0.05 0.3413 0.1343 0.6002 0.2528 1.0508 0.4819 1.8151 1.0524 2.297 1.7175 0.4791 0.6636 0.7153 1.3761 0.7061 2.1365-0.0106 0.7635-0.2067 1.5651-0.5897 2.4002-0.3308 0.7211-0.768 1.3412-1.3086 1.8617-0.541 0.5203-1.1532 0.8549-1.8413 1.0055-0.6883 0.1507-1.4061 0.0564-2.1519-0.2854zm4.7622-9.6816-6.2846-2.301c-0.845-0.3348-1.4931-0.803-1.9461-1.4094-0.4545-0.6034-0.7099-1.2961-0.7664-2.0786-0.0533-0.7815 0.0684-1.6069 0.3694-2.4789 0.2962-0.8086 0.6887-1.506 1.1767-2.0892 0.4879-0.5831 1.1197-0.9874 1.891-1.2104 0.7715-0.2232 1.6709-0.1754 2.705 0.1456l6.2053 2.2719c0.7545 0.2762 1.3988 0.6169 1.9405 1.021 0.5417 0.4042 0.9023 0.7997 1.0839 1.1912l2.2683-0.8548-0.7592 3.1061-1.101 0.4797c-0.1149 0.55-0.263 1.0734-0.4437 1.5669-0.33 0.9011-0.767 1.6218-1.3125 2.1552-0.5466 0.5363-1.2341 0.8552-2.0692 0.9573-0.8354 0.1022-1.8208-0.0565-2.9574-0.4726zm-4.7481-5.5511 6.3802 2.3361c0.5731 0.2097 1.0587 0.2538 1.4584 0.1294 0.3993-0.1245 0.6601-0.354 0.7847-0.6946 0.1097-0.3678 0.051-0.7107-0.1809-1.0341-0.233-0.3198-0.7612-0.6324-1.589-0.9355l-6.0586-2.2182c-1.0951-0.4011-1.7818-0.2119-2.0664 0.5648-0.107 0.3617-0.0827 0.699 0.0616 1.0156 0.1473 0.3173 0.5511 0.5951 1.21 0.8365z"/>
   </g>
  </g>
 </g>
</svg>
